{"text_format":"1","workbook":"xlsx","n_sheets":5,"sheets":["Start","Report","Measure results","Config","Translate"],"not_rendered":{"charts":1,"images":2,"macros":1,"external_links":0,"defined_names":79,"comments":0,"pivot_tables":0},"unopened":[],"bounds":{"document_bytes":16777216,"sheet_cells":100000,"rows_first":2000,"rows_last":500,"rows_between":2000,"halvings":0,"cell_chars":16384,"cell_head_chars":4096},"cells_cut":0,"cells_raw":0,"read":"whole","date_system":"1900"}

{"sheet":"Start","index":0,"n_rows":41,"n_cols":10,"rows_kept":41,"cut":false,"hidden":false,"merged":[[32,1,32,2],[17,2,17,8],[18,2,18,8],[19,1,21,1],[19,2,21,8],[24,1,24,2],[24,4,24,8],[25,4,25,6],[26,4,26,6],[27,4,27,6],[28,4,28,6],[29,4,29,6],[30,4,31,6],[28,7,28,8],[30,7,31,8],[16,2,16,8],[11,1,11,2],[11,5,11,8],[12,6,12,8],[13,6,13,8],[15,1,15,8]]}
[]
[null,"Language",2]
[]
[null,null,null,null,null,null,"Report generator for TechnoTeam goniospectrometric result files (*.csv)"]
[null,null,2,null,null,null,"© TechnoTeam Bildverarbeitung GmbH"]
[null,null,null,null,null,null,"Version 2018-09-28"]
[]
[null,"Nur Angaben in den Zellen mit hellgrünem Hintergrund ändern! Anpassung der Begriffe bzw. der Übersetzung nur über die \"Translate\" Seite!"]
[null,"Only edit content in cells marked with light green backgroud! Modification of the translation only by using the \"Translate\" page!"]
[]
[]
[null,{"$f":"Translate!A13","v":"Protocol details"},null,null,null,{"$f":"Translate!A15","v":"Measuring system"}]
[null,{"$f":"Translate!A14","v":"Protocol no."},"0815",null,null,{"$f":"Translate!A16","v":"Type"},"Goniophotometer RiGO801 - 2000",null,null,"Enter your device data here"]
[null,null,null,null,null,{"$f":"Translate!A17","v":"Manufacturer"},"TechnoTeam Bildverarbeitung GmbH"]
[]
[null,{"$f":"Translate!A19","v":"Details of DUT"}]
[null,{"$f":"Translate!A20","v":"Product"},"LED Leuchte"]
[null,{"$f":"Translate!A21","v":"Manufacturer"},"TechnoTeam Bildverarbeitung GmbH"]
[null,{"$f":"Translate!A22","v":"S/N"},"1234"]
[null,{"$f":"Translate!A23","v":"Description"},"Testmuster"]
[]
[]
[]
[]
[null,{"$f":"Translate!A24","v":"Measurement details"},null,null,{"$f":"Translate!A31","v":"Report settings"}]
[null,{"$f":"Translate!A25","v":"Measurement date"},"2016-09-01",null,{"$f":"Translate!A32","v":"Limit wavelength range [nm]"},null,null,400,800]
[null,{"$f":"Translate!A26","v":"Ambient temperature [°C]"},25,null,{"$f":"Translate!A33","v":"Color diagram"}]
[null,{"$f":"Translate!A27","v":"Voltage [V]"},230,null,{"$f":"Translate!A34","v":"Color - mean color coordinate"}]
[null,{"$f":"Translate!A28","v":"Current [A]"},0.5,null,{"$f":"Translate!A35","v":"Show color coordinates list"}]
[null,{"$f":"Translate!A29","v":"Active power [W]"},115,null,{"$f":"Translate!A36","v":"Color - color coordinates list"}]
[null,{"$f":"Translate!A30","v":"Power factor"},1,null,{"$f":"Translate!A37","v":"Threshold for displayed color coordinates (% of maximum illuminance)"},null,null,0.1,null,"(LM79/EN13032-4/CIE S 025: 10%)"]
[]
[null,{"$f":"Translate!A38","v":"Measurement results"}]
[null,{"$f":"Translate!A39","v":"Luminous flux [lm]"},42]
[]
[]
[]
[]
[]
[]
[null,"License:    This Microsoft Excel Worksheet and macro source code is freeware and IS DISTRIBUTED AS IS. NO WARRANTY OF ANY KIND IS EXPRESSED OR IMPLIED."]

{"sheet":"Report","index":1,"n_rows":38,"n_cols":10,"rows_kept":38,"cut":false,"hidden":false,"merged":[[32,0,32,1],[32,2,32,9],[33,0,33,1],[33,2,33,9],[34,0,35,1],[29,0,29,1],[29,2,29,9],[30,0,30,1],[30,2,30,9],[31,0,31,1],[31,2,31,9],[28,0,28,1],[28,2,28,9],[20,0,20,1],[20,2,20,9],[21,0,21,1],[21,2,21,9],[22,0,22,1],[22,2,22,9],[23,2,23,9],[24,0,24,1],[24,2,24,9],[25,0,25,1],[25,2,25,9],[15,0,15,1],[15,2,15,9],[18,0,18,1],[18,2,18,9],[19,0,19,1],[19,2,19,9],[9,0,10,1],[9,2,10,9],[13,0,13,1],[13,2,13,9],[14,0,14,1],[14,2,14,9],[6,0,6,1],[6,2,6,9],[7,0,7,1],[7,2,7,9],[8,0,8,1],[8,2,8,9]]}
[null,null,null,null,null,null,null,null,{"$f":"Translate!A43","v":"Protocol"},{"$f":"Start!C13","v":"0815"}]
[null,null,null,null,null,null,null,null,{"$f":"Translate!A44","v":"Date"},{"$f":"TODAY()","v":"2019-07-01"}]
[null,null,null,null,null,null,null,null,{"$f":"Translate!A45","v":"Page"},"1/1"]
[]
[{"$f":"Translate!A42","v":"Measurement protocol - goniospectrometric measurement"}]
[{"$f":"Translate!A46","v":"DUT"}]
[{"$f":"Start!B17","v":"Product"},null,{"$f":"Start!C17","v":"LED Leuchte"}]
[{"$f":"Start!B18","v":"Manufacturer"},null,{"$f":"Start!C18","v":"TechnoTeam Bildverarbeitung GmbH"}]
[{"$f":"Start!B19","v":"S/N"},null,{"$f":"Start!C19","v":"1234"}]
[{"$f":"Start!B20","v":"Description"},null,{"$f":"Start!C20","v":"Testmuster"}]
[]
[]
[{"$f":"Translate!A47","v":"Measuring system"}]
[{"$f":"Start!F13","v":"Type"},null,{"$f":"Start!G13","v":"Goniophotometer RiGO801 - 2000"}]
[{"$f":"Start!F14","v":"Manufacturer"},null,{"$f":"Start!G14","v":"TechnoTeam Bildverarbeitung GmbH"}]
[{"$f":"Translate!A18","v":"Spectroradiometer"},null,"specbos 1211 (JETI Technische Instrumente GmbH), S/N 2181179"]
[]
[{"$f":"Translate!A48","v":"Information on the measurement"}]
[{"$f":"Start!B26","v":"Measurement date"},null,{"$f":"Start!C26","v":"2016-09-01"}]
[{"$f":"Start!B27","v":"Ambient temperature [°C]"},null,{"$f":"Start!C27","v":25}]
[{"$f":"Start!B28","v":"Voltage [V]"},null,{"$f":"Start!C28","v":230}]
[{"$f":"Start!B29","v":"Current [A]"},null,{"$f":"Start!C29","v":0.5}]
[{"$f":"Start!B30","v":"Active power [W]"},null,{"$f":"Start!C30","v":115}]
[{"$f":"Start!B31","v":"Power factor"},null,{"$f":"Start!C31","v":1}]
[{"$f":"Translate!A50","v":"Measuring method"},null,{"$f":"Translate!A49","v":"Goniospectrometric measurenent according to LM-79-08, EN 13032-4 and CIE S 025"}]
[{"$f":"Translate!A51","v":"Wavelength range"},null,"380 (1) 850 nm"]
[]
[{"$f":"Translate!A52","v":"Measuring results"}]
[{"$f":"Start!B34","v":"Luminous flux [lm]"},null,{"$f":"Start!C34","v":42}]
[{"$f":"Translate!A53","v":"Color coordinates"},null,"x=0,4667; y=0,4195; u'=0,2629; v'=0,5317"]
[{"$f":"Translate!A54","v":"Color temperature [K]"},null,"2675"]
[{"$f":"Translate!A55","v":"Dom. Wavelength [nm]"},null,"583,5"]
[{"$f":"Translate!A56","v":"Color saturation [%]"},null,"66"]
[{"$f":"Translate!A57","v":"Max. delta u'v'"},null,"0,0022"]
[{"$f":"Translate!A58","v":"Color Rendering Index (CRI)"},null,"Ra = 79,6","R1 = 79","R2 = 94","R3 = 88","R4 = 74","R5 = 80","R6 = 95","R7 = 76"]
[null,null,"R8 = 50","R9 = -4","R10 = 87","R11 = 73","R12 = 77","R13 = 83","R14 = 94","R15 = 69"]
[]
[{"$f":"Translate!A60","v":"Spectrum"},null,null,null,null,{"$f":"Translate!A61","v":"Color diagram (CIE 1931)"}]

{"sheet":"Measure results","index":2,"n_rows":1067,"n_cols":41,"rows_kept":1067,"cut":false,"hidden":false,"merged":[]}
["Driver information","Description","Software driver for spectrometer,\nmanufacturer of spectrometer: JETI Technische Instrumente GmbH"]
[null,"Manufacturer","TechnoTeam Bildverarbeitung GmbH\nhttp://www.technoteam.de"]
[null,"Date","Jul 30 2018"]
[null,"Version","rigo801.exe, v.1.7.1"]
["Device specific parameters","Device information","Manufacturer","JETI Technische Instrumente GmbH"]
[null,null,"Device type","specbos 1211"]
[null,null,"Serial number",2181179]
[null,null,"Sensor-ID",105]
[null,null,"Firmware","SB1211_M30626_SPEC_RAD VERSION 3.2.11 290917"]
[null,null,"Api version","jeti_core.dll: 4.4.0"]
[null,"Calibration","Wavelength calibration","Use calibration",1]
[null,null,null,"C0 [nm/pixel^0]",350]
[null,null,null,"C1 [nm/pixel^1]",1]
[null,null,"Linearity correction","Use linearity correction",0]
[null,null,null,"Polynomial degree",-1]
[null,null,"Dark signal correction","Use",0]
[null,null,"Factory calibration","Mode","Irradiance"]
[null,null,null,"Remark","bundle 0.35m"]
[null,null,null,"Wavelength range begin",350]
[null,null,null,"Wavelength range end",1000]
[null,null,null,"Wavelength range step",1]
["General information about measurement","Spectral range","Start wavelength",380]
[null,null,"End wavelength",850]
[null,null,"Resolution",1]
[null,null,"Unit","nm"]
[null,"Calibration","Wavelengths","User calibration","Use",0]
[null,null,null,null,"C0 (Offset)",0]
[null,null,null,null,"C1 (Factor)",1]
[null,null,null,"Factory calibration","Use",1]
[null,null,null,"Unit","german","Wellenlänge"]
[null,null,null,null,"english","Wavelength"]
[null,null,"Intensity","Relate to integration time",0]
[null,null,null,"User calibration","Use",0]
[null,null,null,null,"C0 (Offset)",0]
[null,null,null,null,"C1 (Factor)",1]
[null,null,null,"Factory calibration","Use",1]
[null,null,null,"Unit","german","Spektrale Bestrahlungsstärke"]
[null,null,null,null,"english","Irradiance"]
[null,"results","LM-79-08 conformity",1]
[null,null,"Color characteristics, integral","Chromaticity x",0.46673900000000001]
[null,null,null,"Chromaticity y",0.41953699999999999]
[null,null,null,"Chromaticity u'",0.26291599999999998]
[null,null,null,"Chromaticity v'",0.53173499999999996]
[null,null,null,"Max. Delta u'v'",2.17432E-3]
[null,null,null,"Dom. wavelength [nm]",583.53499999999997]
[null,null,null,"Color purity [%]",66.045699999999997]
[null,null,null,"CCT [K]",2674.72]
[null,null,null,"CCT chromatic distance Duv",2.6884299999999999E-3]
[null,null,null,"CRI general",79.559899999999999]
[null,null,null,"CRI chromaticity difference",6.5133800000000006E-2]
[null,null,null,"CRI, TCS1",79.012699999999995]
[null,null,null,"CRI, TCS2",93.930800000000005]
[null,null,null,"CRI, TCS3",88.476500000000001]
[null,null,null,"CRI, TCS4",73.932900000000004]
[null,null,null,"CRI, TCS5",79.572400000000002]
[null,null,null,"CRI, TCS6",95.017499999999998]
[null,null,null,"CRI, TCS7",76.390500000000003]
[null,null,null,"CRI, TCS8",50.145800000000001]
[null,null,null,"CRI, TCS9",-4.0820600000000002]
[null,null,null,"CRI, TCS10",87.286199999999994]
[null,null,null,"CRI, TCS11",72.849999999999994]
[null,null,null,"CRI, TCS12",77.270099999999999]
[null,null,null,"CRI, TCS13",82.793199999999999]
[null,null,null,"CRI, TCS14",94.006600000000006]
[null,null,null,"CRI, TCS15",69.259799999999998]
[null,"Additional information","Measurement radius [m]",0]
[null,null,"Axes","Tolerance 'THETA' [°]",0.08]
[null,null,null,"Tolerance 'PHI' [°]",0.08]
[null,null,"Measure positions information","Type of position list","polar grid"]
[null,null,null,"Lattice constants","Lattice constant 'THETA' [°]",10]
[null,null,null,null,"Lattice constant 'PHI' [°]",90]
["Single measurements","Measurement settings","Integration time [s]",null,2.0270000000000001,2.0270000000000001,2.0270000000000001,2.0270000000000001,2.0270000000000001,2.0270000000000001,2.0270000000000001,2.0270000000000001,2.0270000000000001,2.0270000000000001,2.0270000000000001,2.0270000000000001,2.0270000000000001,2.0270000000000001,2.0270000000000001,2.0270000000000001,2.0270000000000001,2.0270000000000001,2.0270000000000001,2.0270000000000001,2.0270000000000001,2.0270000000000001,2.0270000000000001,2.0270000000000001,2.0270000000000001,2.0270000000000001,2.0270000000000001,2.0270000000000001,2.0270000000000001,2.0270000000000001,2.0270000000000001,2.0270000000000001,2.0270000000000001,2.0270000000000001,2.0270000000000001,2.0270000000000001,2.0270000000000001]
[null,null,"Number averages",null,2,2,2,2,2,2,2,2,2,2,2,2,2,2,2,2,2,2,2,2,2,2,2,2,2,2,2,2,2,2,2,2,2,2,2,2,2]
[null,null,"Use average",null,0,0,0,0,0,0,0,0,0,0,0,0,0,0,0,0,0,0,0,0,0,0,0,0,0,0,0,0,0,0,0,0,0,0,0,0,0]
[null,null,"Average device intern",null,1,1,1,1,1,1,1,1,1,1,1,1,1,1,1,1,1,1,1,1,1,1,1,1,1,1,1,1,1,1,1,1,1,1,1,1,1]
[null,null,"Automatic integration time","Device intern",1,1,1,1,1,1,1,1,1,1,1,1,1,1,1,1,1,1,1,1,1,1,1,1,1,1,1,1,1,1,1,1,1,1,1,1,1]
[null,null,null,"Use",0,0,0,0,0,0,0,0,0,0,0,0,0,0,0,0,0,0,0,0,0,0,0,0,0,0,0,0,0,0,0,0,0,0,0,0,0]
[null,null,null,"Minimal integration time [s]",5.0000000000000001E-3,5.0000000000000001E-3,5.0000000000000001E-3,5.0000000000000001E-3,5.0000000000000001E-3,5.0000000000000001E-3,5.0000000000000001E-3,5.0000000000000001E-3,5.0000000000000001E-3,5.0000000000000001E-3,5.0000000000000001E-3,5.0000000000000001E-3,5.0000000000000001E-3,5.0000000000000001E-3,5.0000000000000001E-3,5.0000000000000001E-3,5.0000000000000001E-3,5.0000000000000001E-3,5.0000000000000001E-3,5.0000000000000001E-3,5.0000000000000001E-3,5.0000000000000001E-3,5.0000000000000001E-3,5.0000000000000001E-3,5.0000000000000001E-3,5.0000000000000001E-3,5.0000000000000001E-3,5.0000000000000001E-3,5.0000000000000001E-3,5.0000000000000001E-3,5.0000000000000001E-3,5.0000000000000001E-3,5.0000000000000001E-3,5.0000000000000001E-3,5.0000000000000001E-3,5.0000000000000001E-3,5.0000000000000001E-3]
[null,null,null,"Maximal integration time [s]",60,60,60,60,60,60,60,60,60,60,60,60,60,60,60,60,60,60,60,60,60,60,60,60,60,60,60,60,60,60,60,60,60,60,60,60,60]
[null,null,"Raw mode",null,0,0,0,0,0,0,0,0,0,0,0,0,0,0,0,0,0,0,0,0,0,0,0,0,0,0,0,0,0,0,0,0,0,0,0,0,0]
{"$rows_left_out":988}
{"sheet":"Config","index":3,"n_rows":54,"n_cols":6,"rows_kept":54,"cut":false,"hidden":false,"merged":[]}
["Do not edit!"]
[]
[]
[]
[]
["Table of possible names of nodes (Languages, version depending naming)"]
[]
["Tree level","Node Description","Names"]
[1,"Basic driver information","Driver information","Treiberinformationen"]
[1,"Device specific parameters","Device specific parameters","Gerätespezifische Parameter"]
[2,"Device information","Device information","Geräteinformationen"]
[3,"Manufacturer","Manufacturer","Hersteller"]
[3,"Device type","Device type","Gerätetyp"]
[3,"Serial number","Serial number","Seriennummer"]
[1,"General information about measurement","General information about measurement","Angaben zur Gesamtmessung"]
[2,"Spectral range","Spectral range","Spektralbereich"]
[3,"Start wavelength","Start wavelength","Startwellenlänge"]
[3,"End wavelength","End wavelength","Endwellenlänge"]
[3,"Resolution","Resolution","Auflösung"]
[2,"Measurement results of the integral measurement","Measurement values","Messwerte","results"]
[3,"Flag of conformity to LM-79-08 (color characteristics)","Conformity to LM-79-08 (color characteristics)","Konformität nach LM-79-08 (Farbcharakteristika)","LM-79-08 Konformität","LM-79-08 conformity"]
[3,"List of calculated integral colorimetric values","Mean color characteristics","Farbmaßzahlen Mittelwerte","Farbmaßzahlen, integral","Color characteristics, integral"]
[4,"Chromaticity x","Chromaticity x","Farbwertanteil x"]
[4,"Chromaticity y","Chromaticity y","Farbwertanteil y"]
[4,"Chromaticity u'","Chromaticity u'","Farbwertanteil u'"]
[4,"Chromaticity v'","Chromaticity v'","Farbwertanteil v'"]
[4,"Dom. wavelength [nm]","Dom. wavelength [nm]","Dom. Wellenlänge [nm]"]
[4,"Color purity [%]","Color purity [%]","Farbsättigung [%]"]
[4,"Corr. color temp. [K]","Corr. color temp. [K]","Farbtemperatur [K]","CCT [K]"]
[4,"chromaticity distance Duv / DC (delta uv)","Non-uniformity of chromaticity Du'v'","Farbungleichmäßigkeit Du'v'","max. Delta u'v'","Max. Delta u'v'"]
[4,"CRI general","CRI general","CRI allgemein"]
[4,"CRI, test chart 1 ","CRI, TCS 1","CRI, Testfarbe  1","CRI, Testfarbe 1","CRI, TCS1"]
[4,"CRI, test chart 2","CRI, TCS 2","CRI, Testfarbe  2","CRI, Testfarbe 2","CRI, TCS2"]
[4,"CRI, test chart 3","CRI, TCS 3","CRI, Testfarbe  3","CRI, Testfarbe 3","CRI, TCS3"]
[4,"CRI, test chart 4","CRI, TCS 4","CRI, Testfarbe  4","CRI, Testfarbe 4","CRI, TCS4"]
[4,"CRI, test chart 5","CRI, TCS 5","CRI, Testfarbe  5","CRI, Testfarbe 5","CRI, TCS5"]
[4,"CRI, test chart 6","CRI, TCS 6","CRI, Testfarbe  6","CRI, Testfarbe 6","CRI, TCS6"]
[4,"CRI, test chart 7","CRI, TCS 7","CRI, Testfarbe  7","CRI, Testfarbe 7","CRI, TCS7"]
[4,"CRI, test chart 8","CRI, TCS 8","CRI, Testfarbe  8","CRI, Testfarbe 8","CRI, TCS8"]
[4,"CRI, test chart 9","CRI, TCS 9","CRI, Testfarbe  9","CRI, Testfarbe 9","CRI, TCS9"]
[4,"CRI, test chart 10","CRI, TCS10","CRI, Testfarbe 10"]
[4,"CRI, test chart 11","CRI, TCS11","CRI, Testfarbe 11"]
[4,"CRI, test chart 12","CRI, TCS12","CRI, Testfarbe 12"]
[4,"CRI, test chart 13","CRI, TCS13","CRI, Testfarbe 13"]
[4,"CRI, test chart 14","CRI, TCS14","CRI, Testfarbe 14"]
[4,"CRI, test chart 15","CRI, TCS15","CRI, Testfarbe 15"]
[1,"Root node for all results of single measurements","Single measurements","Einzelmessungen"]
[2,"Block with additional information for each single measuement","Additional information","Zusatzinformationen"]
[3,"Color characteristics","Color characteristics","Farbmaßzahlen"]
[4,"Chromaticity x","Chromaticity x","Farbwertanteil x"]
[4,"Chromaticity y","Chromaticity y","Farbwertanteil y"]
[4,"Illuminances","Illuminance [lx]","Beleuchtungsstärke [lx]"]
[2,"Node with list of measure results (SPD)","Measurement","Messung"]
[4,"Column title of wavelenghts","Wavelength","Wellenlänge"]

{"sheet":"Translate","index":4,"n_rows":62,"n_cols":4,"rows_kept":62,"cut":false,"hidden":false,"merged":[]}
["Translation of terms on the pages \"Start\" and \"Report\". Only edit content in cells marked with light green backgroud! If necessary contact TechnoTeam for the setup of additional languages."]
[]
[]
["Available languages","Deutsch"]
[null,"English"]
[null,"[new language]"]
[]
[]
[]
[null,{"$f":"B4","v":"Deutsch"},{"$f":"B5","v":"English"},{"$f":"B6","v":"[new language]"}]
[{"$f":"INDEX(B$11:J$227, ROW()-ROW(B$10), Start!$C$2)","v":"Load file"},"Messdatei laden …","Load file","Load file"]
[{"$f":"INDEX(B$11:J$227, ROW()-ROW(B$10), Start!$C$2)","v":"Generate report"},"Report generieren","Generate report","Generate report"]
[{"$f":"INDEX(B$11:J$227, ROW()-ROW(B$10), Start!$C$2)","v":"Protocol details"},"Angaben zum Protokoll","Protocol details","Protocol details"]
[{"$f":"INDEX(B$11:J$227, ROW()-ROW(B$10), Start!$C$2)","v":"Protocol no."},"Protokollnummer","Protocol no.","Protocol no."]
[{"$f":"INDEX(B$11:J$227, ROW()-ROW(B$10), Start!$C$2)","v":"Measuring system"},"Angaben zum Messsystem","Measuring system","Measuring system"]
[{"$f":"INDEX(B$11:J$227, ROW()-ROW(B$10), Start!$C$2)","v":"Type"},"Typ","Type","Type"]
[{"$f":"INDEX(B$11:J$227, ROW()-ROW(B$10), Start!$C$2)","v":"Manufacturer"},"Hersteller","Manufacturer","Manufacturer"]
[{"$f":"INDEX(B$11:J$227, ROW()-ROW(B$10), Start!$C$2)","v":"Spectroradiometer"},"Spektroradiometer","Spectroradiometer","Spectroradiometer"]
[{"$f":"INDEX(B$11:J$227, ROW()-ROW(B$10), Start!$C$2)","v":"Details of DUT"},"Angaben zum Messobjekt","Details of DUT","Details of DUT"]
[{"$f":"INDEX(B$11:J$227, ROW()-ROW(B$10), Start!$C$2)","v":"Product"},"Produkt","Product","Product"]
[{"$f":"INDEX(B$11:J$227, ROW()-ROW(B$10), Start!$C$2)","v":"Manufacturer"},"Hersteller","Manufacturer","Manufacturer"]
[{"$f":"INDEX(B$11:J$227, ROW()-ROW(B$10), Start!$C$2)","v":"S/N"},"Seriennummer","S/N","S/N"]
[{"$f":"INDEX(B$11:J$227, ROW()-ROW(B$10), Start!$C$2)","v":"Description"},"Beschreibung","Description","Description"]
[{"$f":"INDEX(B$11:J$227, ROW()-ROW(B$10), Start!$C$2)","v":"Measurement details"},"Angaben zur Messung","Measurement details","Measurement details"]
[{"$f":"INDEX(B$11:J$227, ROW()-ROW(B$10), Start!$C$2)","v":"Measurement date"},"Messdatum","Measurement date","Measurement date"]
[{"$f":"INDEX(B$11:J$227, ROW()-ROW(B$10), Start!$C$2)","v":"Ambient temperature [°C]"},"Umgebungstemperatur [°C]","Ambient temperature [°C]","Ambient temperature [°C]"]
[{"$f":"INDEX(B$11:J$227, ROW()-ROW(B$10), Start!$C$2)","v":"Voltage [V]"},"Spannung [V]","Voltage [V]","Voltage [V]"]
[{"$f":"INDEX(B$11:J$227, ROW()-ROW(B$10), Start!$C$2)","v":"Current [A]"},"Strom [A]","Current [A]","Current [A]"]
[{"$f":"INDEX(B$11:J$227, ROW()-ROW(B$10), Start!$C$2)","v":"Active power [W]"},"Wirkleistung [W]","Active power [W]","Active power [W]"]
[{"$f":"INDEX(B$11:J$227, ROW()-ROW(B$10), Start!$C$2)","v":"Power factor"},"Leistungsfaktor","Power factor","Power factor"]
[{"$f":"INDEX(B$11:J$227, ROW()-ROW(B$10), Start!$C$2)","v":"Report settings"},"Reporteinstellungen","Report settings","Report settings"]
[{"$f":"INDEX(B$11:J$227, ROW()-ROW(B$10), Start!$C$2)","v":"Limit wavelength range [nm]"},"Wellenlängenbereich begrenzen auf [nm]","Limit wavelength range [nm]","Limit wavelength range [nm]"]
[{"$f":"INDEX(B$11:J$227, ROW()-ROW(B$10), Start!$C$2)","v":"Color diagram"},"Farbdiagramm","Color diagram","Color diagram"]
[{"$f":"INDEX(B$11:J$227, ROW()-ROW(B$10), Start!$C$2)","v":"Color - mean color coordinate"},"Farbe - mittlere Farbkoordinate","Color - mean color coordinate","Color - mean color coordinate"]
[{"$f":"INDEX(B$11:J$227, ROW()-ROW(B$10), Start!$C$2)","v":"Show color coordinates list"},"Farbkoordinatenliste anzeigen","Show color coordinates list","Show color coordinates list"]
[{"$f":"INDEX(B$11:J$227, ROW()-ROW(B$10), Start!$C$2)","v":"Color - color coordinates list"},"Farbe - Farbkoordinatenliste","Color - color coordinates list","Color - color coordinates list"]
[{"$f":"INDEX(B$11:J$227, ROW()-ROW(B$10), Start!$C$2)","v":"Threshold for displayed color coordinates (% of maximum illuminance)"},"Schwelle für angezeigte Farbkoordinaten (% von max. Beleuchtungsstärke)","Threshold for displayed color coordinates (% of maximum illuminance)","Threshold for displayed color coordinates (% of maximum illuminance)"]
[{"$f":"INDEX(B$11:J$227, ROW()-ROW(B$10), Start!$C$2)","v":"Measurement results"},"Messergebnisse","Measurement results","Measurement results"]
[{"$f":"INDEX(B$11:J$227, ROW()-ROW(B$10), Start!$C$2)","v":"Luminous flux [lm]"},"Lichtstrom [lm]","Luminous flux [lm]","Luminous flux [lm]"]
[]
[]
[{"$f":"INDEX(B$11:J$227, ROW()-ROW(B$10), Start!$C$2)","v":"Measurement protocol - goniospectrometric measurement"},"Messprotokoll - Goniospektrometrische Messung","Measurement protocol - goniospectrometric measurement","Measurement protocol - goniospectrometric measurement"]
[{"$f":"INDEX(B$11:J$227, ROW()-ROW(B$10), Start!$C$2)","v":"Protocol"},"Protokoll","Protocol","Protocol"]
[{"$f":"INDEX(B$11:J$227, ROW()-ROW(B$10), Start!$C$2)","v":"Date"},"Datum","Date","Date"]
[{"$f":"INDEX(B$11:J$227, ROW()-ROW(B$10), Start!$C$2)","v":"Page"},"Seite","Page","Page"]
[{"$f":"INDEX(B$11:J$227, ROW()-ROW(B$10), Start!$C$2)","v":"DUT"},"Messobjekt","DUT","DUT"]
[{"$f":"INDEX(B$11:J$227, ROW()-ROW(B$10), Start!$C$2)","v":"Measuring system"},"Messsystem","Measuring system","Measuring system"]
[{"$f":"INDEX(B$11:J$227, ROW()-ROW(B$10), Start!$C$2)","v":"Information on the measurement"},"Angaben zur Messung","Information on the measurement","Information on the measurement"]
[{"$f":"INDEX(B$11:J$227, ROW()-ROW(B$10), Start!$C$2)","v":"Goniospectrometric measurenent according to LM-79-08, EN 13032-4 and CIE S 025"},"Goniospektrometrische Messung entsprechend LM-79-08, EN 13032-4 und CIE S 025","Goniospectrometric measurenent according to LM-79-08, EN 13032-4 and CIE S 025","Goniospectrometric measurenent according to LM-79-08, EN 13032-4 and CIE S 025"]
[{"$f":"INDEX(B$11:J$227, ROW()-ROW(B$10), Start!$C$2)","v":"Measuring method"},"Messverfahren","Measuring method","Measuring method"]
[{"$f":"INDEX(B$11:J$227, ROW()-ROW(B$10), Start!$C$2)","v":"Wavelength range"},"Wellenlängenbereich","Wavelength range","Wavelength range"]
[{"$f":"INDEX(B$11:J$227, ROW()-ROW(B$10), Start!$C$2)","v":"Measuring results"},"Messergebnisse","Measuring results","Measuring results"]
[{"$f":"INDEX(B$11:J$227, ROW()-ROW(B$10), Start!$C$2)","v":"Color coordinates"},"Farbkoordinaten","Color coordinates","Color coordinates"]
[{"$f":"INDEX(B$11:J$227, ROW()-ROW(B$10), Start!$C$2)","v":"Color temperature [K]"},"Farbtemperatur [K]","Color temperature [K]","Color temperature [K]"]
[{"$f":"INDEX(B$11:J$227, ROW()-ROW(B$10), Start!$C$2)","v":"Dom. Wavelength [nm]"},"Dom. Wellenlänge [nm]","Dom. Wavelength [nm]","Dom. Wavelength [nm]"]
[{"$f":"INDEX(B$11:J$227, ROW()-ROW(B$10), Start!$C$2)","v":"Color saturation [%]"},"Farbsättigung [%]","Color saturation [%]","Color saturation [%]"]
[{"$f":"INDEX(B$11:J$227, ROW()-ROW(B$10), Start!$C$2)","v":"Max. delta u'v'"},"Max. delta u'v'","Max. delta u'v'","Max. delta u'v'"]
[{"$f":"INDEX(B$11:J$227, ROW()-ROW(B$10), Start!$C$2)","v":"Color Rendering Index (CRI)"},"Color Rendering Index (CRI)","Color Rendering Index (CRI)","Color Rendering Index (CRI)"]
[]
[{"$f":"INDEX(B$11:J$227, ROW()-ROW(B$10), Start!$C$2)","v":"Spectrum"},"Spektrum","Spectrum","Spectrum"]
[{"$f":"INDEX(B$11:J$227, ROW()-ROW(B$10), Start!$C$2)","v":"Color diagram (CIE 1931)"},"Farbdiagramm (CIE 1931)","Color diagram (CIE 1931)","Color diagram (CIE 1931)"]
[{"$f":"INDEX(B$11:J$227, ROW()-ROW(B$10), Start!$C$2)","v":"Wavelength [nm]"},"Wellenlänge [nm]","Wavelength [nm]","Wavelength [nm]"]