{"text_format":"1","workbook":"xlsx","n_sheets":5,"sheets":["Start","Report","Measure results","Config","Translate"],"not_rendered":{"charts":1,"images":2,"macros":1,"external_links":0,"defined_names":79,"comments":0,"pivot_tables":0},"unopened":[],"bounds":{"document_bytes":16777216,"sheet_cells":100000,"rows_first":2000,"rows_last":500,"rows_between":2000,"halvings":0,"cell_chars":16384,"cell_head_chars":4096},"cells_cut":0,"cells_raw":0,"read":"whole","date_system":"1900"}

{"sheet":"Start","index":0,"n_rows":41,"n_cols":10,"rows_kept":41,"cut":false,"hidden":false,"merged":[[32,1,32,2],[17,2,17,8],[18,2,18,8],[19,1,21,1],[19,2,21,8],[24,1,24,2],[24,4,24,8],[25,4,25,6],[26,4,26,6],[27,4,27,6],[28,4,28,6],[29,4,29,6],[30,4,31,6],[28,7,28,8],[30,7,31,8],[16,2,16,8],[11,1,11,2],[11,5,11,8],[12,6,12,8],[13,6,13,8],[15,1,15,8]]}
[]
[null,"Language",2]
[]
[null,null,null,null,null,null,"Report generator for TechnoTeam goniospectrometric result files (*.csv)"]
[null,null,2,null,null,null,"© TechnoTeam Bildverarbeitung GmbH"]
[null,null,null,null,null,null,"Version 2018-09-28"]
[]
[null,"Nur Angaben in den Zellen mit hellgrünem Hintergrund ändern! Anpassung der Begriffe bzw. der Übersetzung nur über die \"Translate\" Seite!"]
[null,"Only edit content in cells marked with light green backgroud! Modification of the translation only by using the \"Translate\" page!"]
[]
[]
[null,{"$f":"Translate!A13","v":"Protocol details"},null,null,null,{"$f":"Translate!A15","v":"Measuring system"}]
[null,{"$f":"Translate!A14","v":"Protocol no."},"0815",null,null,{"$f":"Translate!A16","v":"Type"},"Goniophotometer RiGO801 - 2000",null,null,"Enter your device data here"]
[null,null,null,null,null,{"$f":"Translate!A17","v":"Manufacturer"},"TechnoTeam Bildverarbeitung GmbH"]
[]
[null,{"$f":"Translate!A19","v":"Details of DUT"}]
[null,{"$f":"Translate!A20","v":"Product"},"LED Leuchte"]
[null,{"$f":"Translate!A21","v":"Manufacturer"},"TechnoTeam Bildverarbeitung GmbH"]
[null,{"$f":"Translate!A22","v":"S/N"},"1234"]
[null,{"$f":"Translate!A23","v":"Description"},"Testmuster"]
[]
[]
[]
[]
[null,{"$f":"Translate!A24","v":"Measurement details"},null,null,{"$f":"Translate!A31","v":"Report settings"}]
[null,{"$f":"Translate!A25","v":"Measurement date"},"2016-09-01",null,{"$f":"Translate!A32","v":"Limit wavelength range [nm]"},null,null,400,800]
[null,{"$f":"Translate!A26","v":"Ambient temperature [°C]"},25,null,{"$f":"Translate!A33","v":"Color diagram"}]
[null,{"$f":"Translate!A27","v":"Voltage [V]"},230,null,{"$f":"Translate!A34","v":"Color - mean color coordinate"}]
[null,{"$f":"Translate!A28","v":"Current [A]"},0.5,null,{"$f":"Translate!A35","v":"Show color coordinates list"}]
[null,{"$f":"Translate!A29","v":"Active power [W]"},115,null,{"$f":"Translate!A36","v":"Color - color coordinates list"}]
[null,{"$f":"Translate!A30","v":"Power factor"},1,null,{"$f":"Translate!A37","v":"Threshold for displayed color coordinates (% of maximum illuminance)"},null,null,0.1,null,"(LM79/EN13032-4/CIE S 025: 10%)"]
[]
[null,{"$f":"Translate!A38","v":"Measurement results"}]
[null,{"$f":"Translate!A39","v":"Luminous flux [lm]"},42]
[]
[]
[]
[]
[]
[]
[null,"License:    This Microsoft Excel Worksheet and macro source code is freeware and IS DISTRIBUTED AS IS. NO WARRANTY OF ANY KIND IS EXPRESSED OR IMPLIED."]

{"sheet":"Report","index":1,"n_rows":38,"n_cols":10,"rows_kept":38,"cut":false,"hidden":false,"merged":[[32,0,32,1],[32,2,32,9],[33,0,33,1],[33,2,33,9],[34,0,35,1],[29,0,29,1],[29,2,29,9],[30,0,30,1],[30,2,30,9],[31,0,31,1],[31,2,31,9],[28,0,28,1],[28,2,28,9],[20,0,20,1],[20,2,20,9],[21,0,21,1],[21,2,21,9],[22,0,22,1],[22,2,22,9],[23,2,23,9],[24,0,24,1],[24,2,24,9],[25,0,25,1],[25,2,25,9],[15,0,15,1],[15,2,15,9],[18,0,18,1],[18,2,18,9],[19,0,19,1],[19,2,19,9],[9,0,10,1],[9,2,10,9],[13,0,13,1],[13,2,13,9],[14,0,14,1],[14,2,14,9],[6,0,6,1],[6,2,6,9],[7,0,7,1],[7,2,7,9],[8,0,8,1],[8,2,8,9]]}
[null,null,null,null,null,null,null,null,{"$f":"Translate!A43","v":"Protocol"},{"$f":"Start!C13","v":"0815"}]
[null,null,null,null,null,null,null,null,{"$f":"Translate!A44","v":"Date"},{"$f":"TODAY()","v":"2019-07-01"}]
[null,null,null,null,null,null,null,null,{"$f":"Translate!A45","v":"Page"},"1/1"]
[]
[{"$f":"Translate!A42","v":"Measurement protocol - goniospectrometric measurement"}]
[{"$f":"Translate!A46","v":"DUT"}]
[{"$f":"Start!B17","v":"Product"},null,{"$f":"Start!C17","v":"LED Leuchte"}]
[{"$f":"Start!B18","v":"Manufacturer"},null,{"$f":"Start!C18","v":"TechnoTeam Bildverarbeitung GmbH"}]
[{"$f":"Start!B19","v":"S/N"},null,{"$f":"Start!C19","v":"1234"}]
[{"$f":"Start!B20","v":"Description"},null,{"$f":"Start!C20","v":"Testmuster"}]
[]
[]
[{"$f":"Translate!A47","v":"Measuring system"}]
[{"$f":"Start!F13","v":"Type"},null,{"$f":"Start!G13","v":"Goniophotometer RiGO801 - 2000"}]
[{"$f":"Start!F14","v":"Manufacturer"},null,{"$f":"Start!G14","v":"TechnoTeam Bildverarbeitung GmbH"}]
[{"$f":"Translate!A18","v":"Spectroradiometer"},null,"specbos 1211 (JETI Technische Instrumente GmbH), S/N 2181179"]
[]
[{"$f":"Translate!A48","v":"Information on the measurement"}]
[{"$f":"Start!B26","v":"Measurement date"},null,{"$f":"Start!C26","v":"2016-09-01"}]
[{"$f":"Start!B27","v":"Ambient temperature [°C]"},null,{"$f":"Start!C27","v":25}]
[{"$f":"Start!B28","v":"Voltage [V]"},null,{"$f":"Start!C28","v":230}]
[{"$f":"Start!B29","v":"Current [A]"},null,{"$f":"Start!C29","v":0.5}]
[{"$f":"Start!B30","v":"Active power [W]"},null,{"$f":"Start!C30","v":115}]
[{"$f":"Start!B31","v":"Power factor"},null,{"$f":"Start!C31","v":1}]
[{"$f":"Translate!A50","v":"Measuring method"},null,{"$f":"Translate!A49","v":"Goniospectrometric measurenent according to LM-79-08, EN 13032-4 and CIE S 025"}]
[{"$f":"Translate!A51","v":"Wavelength range"},null,"380 (1) 850 nm"]
[]
[{"$f":"Translate!A52","v":"Measuring results"}]
[{"$f":"Start!B34","v":"Luminous flux [lm]"},null,{"$f":"Start!C34","v":42}]
[{"$f":"Translate!A53","v":"Color coordinates"},null,"x=0,4667; y=0,4195; u'=0,2629; v'=0,5317"]
[{"$f":"Translate!A54","v":"Color temperature [K]"},null,"2675"]
[{"$f":"Translate!A55","v":"Dom. Wavelength [nm]"},null,"583,5"]
[{"$f":"Translate!A56","v":"Color saturation [%]"},null,"66"]
[{"$f":"Translate!A57","v":"Max. delta u'v'"},null,"0,0022"]
[{"$f":"Translate!A58","v":"Color Rendering Index (CRI)"},null,"Ra = 79,6","R1 = 79","R2 = 94","R3 = 88","R4 = 74","R5 = 80","R6 = 95","R7 = 76"]
[null,null,"R8 = 50","R9 = -4","R10 = 87","R11 = 73","R12 = 77","R13 = 83","R14 = 94","R15 = 69"]
[]
[{"$f":"Translate!A60","v":"Spectrum"},null,null,null,null,{"$f":"Translate!A61","v":"Color diagram (CIE 1931)"}]

{"sheet":"Measure results","index":2,"n_rows":1067,"n_cols":41,"rows_kept":1067,"cut":false,"hidden":false,"merged":[]}
["Driver information","Description","Software driver for spectrometer,\nmanufacturer of spectrometer: JETI Technische Instrumente GmbH"]
[null,"Manufacturer","TechnoTeam Bildverarbeitung GmbH\nhttp://www.technoteam.de"]
[null,"Date","Jul 30 2018"]
[null,"Version","rigo801.exe, v.1.7.1"]
["Device specific parameters","Device information","Manufacturer","JETI Technische Instrumente GmbH"]
[null,null,"Device type","specbos 1211"]
[null,null,"Serial number",2181179]
[null,null,"Sensor-ID",105]
[null,null,"Firmware","SB1211_M30626_SPEC_RAD VERSION 3.2.11 290917"]
[null,null,"Api version","jeti_core.dll: 4.4.0"]
[null,"Calibration","Wavelength calibration","Use calibration",1]
[null,null,null,"C0 [nm/pixel^0]",350]
[null,null,null,"C1 [nm/pixel^1]",1]
[null,null,"Linearity correction","Use linearity correction",0]
[null,null,null,"Polynomial degree",-1]
[null,null,"Dark signal correction","Use",0]
[null,null,"Factory calibration","Mode","Irradiance"]
[null,null,null,"Remark","bundle 0.35m"]
[null,null,null,"Wavelength range begin",350]
[null,null,null,"Wavelength range end",1000]
[null,null,null,"Wavelength range step",1]
["General information about measurement","Spectral range","Start wavelength",380]
[null,null,"End wavelength",850]
[null,null,"Resolution",1]
[null,null,"Unit","nm"]
[null,"Calibration","Wavelengths","User calibration","Use",0]
[null,null,null,null,"C0 (Offset)",0]
[null,null,null,null,"C1 (Factor)",1]
[null,null,null,"Factory calibration","Use",1]
[null,null,null,"Unit","german","Wellenlänge"]
[null,null,null,null,"english","Wavelength"]
[null,null,"Intensity","Relate to integration time",0]
[null,null,null,"User calibration","Use",0]
[null,null,null,null,"C0 (Offset)",0]
[null,null,null,null,"C1 (Factor)",1]
[null,null,null,"Factory calibration","Use",1]
[null,null,null,"Unit","german","Spektrale Bestrahlungsstärke"]
[null,null,null,null,"english","Irradiance"]
[null,"results","LM-79-08 conformity",1]
[null,null,"Color characteristics, integral","Chromaticity x",0.46673900000000001]
[null,null,null,"Chromaticity y",0.41953699999999999]
[null,null,null,"Chromaticity u'",0.26291599999999998]
[null,null,null,"Chromaticity v'",0.53173499999999996]
[null,null,null,"Max. Delta u'v'",2.17432E-3]
[null,null,null,"Dom. wavelength [nm]",583.53499999999997]
[null,null,null,"Color purity [%]",66.045699999999997]
[null,null,null,"CCT [K]",2674.72]
[null,null,null,"CCT chromatic distance Duv",2.6884299999999999E-3]
[null,null,null,"CRI general",79.559899999999999]
[null,null,null,"CRI chromaticity difference",6.5133800000000006E-2]
[null,null,null,"CRI, TCS1",79.012699999999995]
[null,null,null,"CRI, TCS2",93.930800000000005]
[null,null,null,"CRI, TCS3",88.476500000000001]
[null,null,null,"CRI, TCS4",73.932900000000004]
[null,null,null,"CRI, TCS5",79.572400000000002]
[null,null,null,"CRI, TCS6",95.017499999999998]
[null,null,null,"CRI, TCS7",76.390500000000003]
[null,null,null,"CRI, TCS8",50.145800000000001]
[null,null,null,"CRI, TCS9",-4.0820600000000002]
[null,null,null,"CRI, TCS10",87.286199999999994]
[null,null,null,"CRI, TCS11",72.849999999999994]
[null,null,null,"CRI, TCS12",77.270099999999999]
[null,null,null,"CRI, TCS13",82.793199999999999]
[null,null,null,"CRI, TCS14",94.006600000000006]
[null,null,null,"CRI, TCS15",69.259799999999998]
[null,"Additional information","Measurement radius [m]",0]
[null,null,"Axes","Tolerance 'THETA' [°]",0.08]
[null,null,null,"Tolerance 'PHI' [°]",0.08]
[null,null,"Measure positions information","Type of position list","polar grid"]
[null,null,null,"Lattice constants","Lattice constant 'THETA' [°]",10]
[null,null,null,null,"Lattice constant 'PHI' [°]",90]
["Single measurements","Measurement settings","Integration time [s]",null,2.0270000000000001,2.0270000000000001,2.0270000000000001,2.0270000000000001,2.0270000000000001,2.0270000000000001,2.0270000000000001,2.0270000000000001,2.0270000000000001,2.0270000000000001,2.0270000000000001,2.0270000000000001,2.0270000000000001,2.0270000000000001,2.0270000000000001,2.0270000000000001,2.0270000000000001,2.0270000000000001,2.0270000000000001,2.0270000000000001,2.0270000000000001,2.0270000000000001,2.0270000000000001,2.0270000000000001,2.0270000000000001,2.0270000000000001,2.0270000000000001,2.0270000000000001,2.0270000000000001,2.0270000000000001,2.0270000000000001,2.0270000000000001,2.0270000000000001,2.0270000000000001,2.0270000000000001,2.0270000000000001,2.0270000000000001]
[null,null,"Number averages",null,2,2,2,2,2,2,2,2,2,2,2,2,2,2,2,2,2,2,2,2,2,2,2,2,2,2,2,2,2,2,2,2,2,2,2,2,2]
[null,null,"Use average",null,0,0,0,0,0,0,0,0,0,0,0,0,0,0,0,0,0,0,0,0,0,0,0,0,0,0,0,0,0,0,0,0,0,0,0,0,0]
[null,null,"Average device intern",null,1,1,1,1,1,1,1,1,1,1,1,1,1,1,1,1,1,1,1,1,1,1,1,1,1,1,1,1,1,1,1,1,1,1,1,1,1]
[null,null,"Automatic integration time","Device intern",1,1,1,1,1,1,1,1,1,1,1,1,1,1,1,1,1,1,1,1,1,1,1,1,1,1,1,1,1,1,1,1,1,1,1,1,1]
[null,null,null,"Use",0,0,0,0,0,0,0,0,0,0,0,0,0,0,0,0,0,0,0,0,0,0,0,0,0,0,0,0,0,0,0,0,0,0,0,0,0]
[null,null,null,"Minimal integration time [s]",5.0000000000000001E-3,5.0000000000000001E-3,5.0000000000000001E-3,5.0000000000000001E-3,5.0000000000000001E-3,5.0000000000000001E-3,5.0000000000000001E-3,5.0000000000000001E-3,5.0000000000000001E-3,5.0000000000000001E-3,5.0000000000000001E-3,5.0000000000000001E-3,5.0000000000000001E-3,5.0000000000000001E-3,5.0000000000000001E-3,5.0000000000000001E-3,5.0000000000000001E-3,5.0000000000000001E-3,5.0000000000000001E-3,5.0000000000000001E-3,5.0000000000000001E-3,5.0000000000000001E-3,5.0000000000000001E-3,5.0000000000000001E-3,5.0000000000000001E-3,5.0000000000000001E-3,5.0000000000000001E-3,5.0000000000000001E-3,5.0000000000000001E-3,5.0000000000000001E-3,5.0000000000000001E-3,5.0000000000000001E-3,5.0000000000000001E-3,5.0000000000000001E-3,5.0000000000000001E-3,5.0000000000000001E-3,5.0000000000000001E-3]
[null,null,null,"Maximal integration time [s]",60,60,60,60,60,60,60,60,60,60,60,60,60,60,60,60,60,60,60,60,60,60,60,60,60,60,60,60,60,60,60,60,60,60,60,60,60]
[null,null,"Raw mode",null,0,0,0,0,0,0,0,0,0,0,0,0,0,0,0,0,0,0,0,0,0,0,0,0,0,0,0,0,0,0,0,0,0,0,0,0,0]
[null,"Additional information","Axes","Position 'THETA' [°]",90.013000000000005,100.01300000000001,110.01300000000001,120.01300000000001,130.01300000000001,140.01300000000001,150.01300000000001,160.01300000000001,170.01300000000001,180.01300000000001,190.01300000000001,200.01300000000001,210.01300000000001,220.01300000000001,230.01300000000001,240.01300000000001,250.01300000000001,260.01299999999998,270.01299999999998,270.01299999999998,260.01299999999998,250.01300000000001,240.01300000000001,230.01300000000001,220.01300000000001,210.01300000000001,200.01300000000001,190.01300000000001,170.01300000000001,160.01300000000001,150.01300000000001,140.01300000000001,130.01300000000001,120.01300000000001,110.01300000000001,100.01300000000001,90.013000000000005]
[null,null,null,"Position 'PHI' [°]",0,0,0,0,0,0,0,0,0,0,0,0,0,0,0,0,0,0,0,89.99,89.99,89.99,89.99,89.99,89.99,89.99,89.99,89.99,89.99,89.99,89.99,89.99,89.99,89.99,89.99,89.99,89.99]
[null,null,"Solid angle [sr]",null,0.273808,0.26963700000000002,0.257274,0.237093,0.20970900000000001,0.175953,0.13685,9.3589400000000003E-2,4.7485100000000002E-2,2.3909400000000001E-2,4.7607400000000001E-2,9.3706200000000003E-2,0.136958,0.17604800000000001,0.209789,0.23715600000000001,0.25731599999999999,0.26965899999999998,0.273808,0.273808,0.26965899999999998,0.25731599999999999,0.23715600000000001,0.209789,0.17604800000000001,0.136958,9.3706200000000003E-2,4.7607400000000001E-2,4.7485100000000002E-2,9.3589400000000003E-2,0.13685,0.175953,0.20970900000000001,0.237093,0.257274,0.26963700000000002,0.273808]
[null,null,"Color characteristics","Tristimulus X",58.4895,68.810199999999995,79.191400000000002,89.024900000000002,97.466899999999995,104.033,108.84099999999999,112.20099999999999,113.959,114.449,113.944,112.17400000000001,109.014,104.336,97.491399999999999,89.410200000000003,79.686400000000006,69.539199999999994,59.453400000000002,60.099699999999999,70.603899999999996,80.241799999999998,89.453500000000005,97.1417,103.411,108.193,111.337,113.217,114.404,113.26600000000001,110.012,105.271,98.363799999999998,89.3994,79.510800000000003,68.742999999999995,58.167099999999998]
[null,null,null,"Tristimulus Y",52.797899999999998,61.987200000000001,71.194599999999994,79.976600000000005,87.441800000000001,93.320499999999996,97.521299999999997,100.34699999999999,102.021,102.46299999999999,101.95399999999999,100.46299999999999,97.674599999999998,93.631399999999999,87.576800000000006,80.386399999999995,71.845500000000001,62.716799999999999,53.812100000000001,54.282200000000003,63.656300000000002,72.119,80.265600000000006,87.141300000000001,92.688199999999995,96.972899999999996,99.663899999999998,101.33199999999999,102.423,101.44499999999999,98.494299999999996,94.484200000000001,88.355900000000005,80.361999999999995,71.726799999999997,62.170200000000001,52.601599999999998]
[null,null,null,"Tristimulus Z",14.8492,16.914899999999999,19.366800000000001,21.739100000000001,23.3657,25.119199999999999,26.302099999999999,27.215800000000002,27.561399999999999,27.615300000000001,27.4697,27.1235,26.3323,25.482700000000001,23.713699999999999,21.869399999999999,19.255299999999998,17.126100000000001,15.024100000000001,14.594799999999999,17.357099999999999,19.067599999999999,21.672799999999999,23.120799999999999,24.720099999999999,26.401,26.6844,27.164200000000001,27.720099999999999,27.7941,26.612100000000002,25.600999999999999,23.855499999999999,21.7773,19.383500000000002,17.020600000000002,14.8507]
[null,null,null,"Chromaticity x",0.4637,0.465839,0.46650999999999998,0.46673300000000001,0.467974,0.46762199999999998,0.46780100000000002,0.46796500000000002,0.46792499999999998,0.46804299999999999,0.468196,0.46785900000000002,0.46783000000000002,0.46693200000000001,0.46695399999999998,0.46648899999999999,0.46658300000000003,0.46551300000000001,0.46343099999999998,0.46597300000000003,0.46567199999999997,0.46807799999999999,0.46738400000000002,0.46837000000000001,0.468306,0.467221,0.46842299999999998,0.46839399999999998,0.46781899999999998,0.46706500000000001,0.46789999999999998,0.46713199999999999,0.46711999999999998,0.46674300000000002,0.46600799999999998,0.46468700000000002,0.46304200000000001]
[null,null,null,"Chromaticity y",0.41857699999999998,0.41964800000000002,0.419402,0.41929499999999997,0.41983900000000002,0.41946899999999998,0.419151,0.41852400000000001,0.418906,0.41902400000000001,0.41893000000000002,0.419014,0.41916599999999998,0.41902600000000001,0.41946499999999998,0.41940899999999998,0.42067300000000002,0.41984100000000002,0.419458,0.42086800000000002,0.41984900000000003,0.42069499999999999,0.41937799999999997,0.420153,0.41974600000000001,0.418769,0.41931000000000002,0.41922399999999999,0.41882799999999998,0.41832200000000003,0.41891400000000001,0.41926600000000003,0.41959299999999999,0.41955999999999999,0.42038599999999998,0.42025699999999999,0.418738]
[null,null,null,"Chromaticity u'",0.26140400000000003,0.262293,0.26283000000000001,0.263019,0.26356800000000002,0.26350899999999999,0.26376500000000003,0.26415,0.26395400000000002,0.26397599999999999,0.26411600000000002,0.26386300000000001,0.26377699999999998,0.263266,0.26308399999999998,0.26281399999999999,0.26231300000000002,0.26200000000000001,0.26084400000000002,0.26183899999999999,0.262098,0.26325399999999999,0.26339800000000002,0.263681,0.263822,0.26356499999999999,0.26409100000000002,0.26411099999999998,0.26392100000000002,0.26366499999999998,0.263934,0.26328699999999999,0.26313399999999998,0.26290799999999998,0.26207399999999997,0.261291,0.26091399999999998]
[null,null,null,"Chromaticity v'",0.53092499999999998,0.53164100000000003,0.53165099999999998,0.53164500000000003,0.53203100000000003,0.53184200000000004,0.531752,0.53154500000000005,0.53168000000000004,0.53174100000000002,0.53173000000000004,0.53171000000000002,0.53176199999999996,0.53157500000000002,0.53174100000000002,0.53164999999999996,0.53212999999999999,0.53166400000000003,0.53121099999999999,0.532111,0.53169,0.532362,0.53177300000000005,0.53220599999999996,0.53204700000000005,0.531524,0.53190400000000004,0.53186800000000001,0.53163499999999997,0.531335,0.53167900000000001,0.531694,0.53181299999999998,0.53174399999999999,0.53193900000000005,0.531694,0.530887]
[null,null,null,"Dom. wavelength [nm]",583.38900000000001,583.43600000000004,583.53300000000002,583.56899999999996,583.60500000000002,583.62599999999998,583.68799999999999,583.79300000000001,583.73400000000004,583.72799999999995,583.755,583.71299999999997,583.68799999999999,583.62599999999998,583.56500000000005,583.53,583.35900000000004,583.37800000000004,583.23699999999997,583.27499999999998,583.39200000000005,583.49400000000003,583.61699999999996,583.59699999999998,583.649,583.69000000000005,583.72199999999998,583.73099999999999,583.73599999999999,583.74,583.73099999999999,583.61,583.56200000000001,583.53200000000004,583.34699999999998,583.24099999999999,583.303]
[null,null,null,"Color purity [%]",64.843800000000002,65.808999999999997,65.935900000000004,65.970799999999997,66.507300000000001,66.290099999999995,66.248099999999994,66.108099999999993,66.211200000000005,66.282300000000006,66.3,66.224000000000004,66.261200000000002,65.9495,66.088399999999993,65.932000000000002,66.341200000000001,65.769099999999995,65.028700000000001,66.217100000000002,65.819100000000006,66.796499999999995,66.191199999999995,66.7209,66.579300000000003,65.958600000000004,66.482500000000002,66.447999999999993,66.156099999999995,65.777199999999993,66.206199999999995,66.081699999999998,66.176699999999997,66.053799999999995,66.0822,65.646799999999999,64.694900000000004]
[null,null,null,"CCT [K]",2708.23,2687.41,2676.39,2672.95,2660.37,2662.27,2657.44,2650.49,2653.93,2653.25,2650.49,2655.64,2657.17,2668.19,2671.26,2676.73,2685.1,2693.36,2718.75,2694.92,2691.23,2665.49,2664.79,2657.44,2655.21,2662.33,2650.34,2650.08,2654.75,2661.02,2654.32,2667.32,2669.99,2674.84,2690.75,2707.46,2718.62]
[null,null,null,"CCT chromatic distance Duv",2.5864299999999998E-3,2.7989400000000002E-3,2.6577300000000001E-3,2.6028100000000001E-3,2.70411E-3,2.5985000000000001E-3,2.4717900000000002E-3,2.2358E-3,2.3751200000000001E-3,2.4085399999999998E-3,2.3637200000000001E-3,2.4187499999999999E-3,2.4750000000000002E-3,2.49198E-3,2.6469200000000001E-3,2.6619299999999999E-3,3.1066700000000002E-3,2.8937699999999999E-3,2.9265900000000002E-3,3.2242899999999999E-3,2.8838800000000001E-3,3.0002499999999999E-3,2.58384E-3,2.78626E-3,2.6463799999999998E-3,2.3787000000000001E-3,2.4821800000000001E-3,2.45378E-3,2.3553100000000002E-3,2.23084E-3,2.3799200000000002E-3,2.56251E-3,2.6799900000000001E-3,2.6962900000000001E-3,3.0495499999999998E-3,3.1097099999999999E-3,2.69944E-3]
[null,null,null,"CRI general",79.587199999999996,79.686400000000006,79.561300000000003,79.728899999999996,79.564700000000002,79.676900000000003,79.453000000000003,79.501300000000001,79.727800000000002,79.5428,79.658600000000007,79.595699999999994,79.578199999999995,79.679299999999998,79.624399999999994,79.456900000000005,79.450299999999999,79.724199999999996,79.569100000000006,79.500900000000001,79.710300000000004,79.192800000000005,79.524500000000003,79.555400000000006,79.479600000000005,79.778099999999995,79.442899999999995,79.410700000000006,79.597399999999993,79.619600000000005,79.432900000000004,79.485299999999995,79.532200000000003,79.512299999999996,79.424800000000005,79.539400000000001,79.492999999999995]
[null,null,null,"CRI chromaticity difference",6.3598799999999997E-2,6.4596600000000004E-2,6.5031199999999997E-2,6.5181299999999998E-2,6.5776200000000007E-2,6.5653900000000001E-2,6.5825499999999995E-2,6.6056100000000006E-2,6.5949599999999997E-2,6.5991900000000006E-2,6.6100500000000006E-2,6.5887899999999999E-2,6.58387E-2,6.5352999999999994E-2,6.5271599999999999E-2,6.5018000000000006E-2,6.4807600000000007E-2,6.4370499999999997E-2,6.3267000000000004E-2,6.4421699999999998E-2,6.4459600000000006E-2,6.5654000000000004E-2,6.5536800000000006E-2,6.59362E-2,6.5987000000000004E-2,6.5574300000000002E-2,6.6148399999999996E-2,6.6150399999999998E-2,6.5905699999999998E-2,6.5581299999999995E-2,6.5933599999999995E-2,6.5416299999999997E-2,6.5339599999999998E-2,6.5131099999999997E-2,6.4540100000000003E-2,6.3817499999999999E-2,6.3191700000000003E-2]
[null,null,null,"CRI, TCS1",79.049400000000006,79.170199999999994,79.0137,79.205699999999993,79.009600000000006,79.132900000000006,78.888999999999996,78.9773,79.251099999999994,78.989599999999996,79.132300000000001,79.124099999999999,79.097200000000001,79.176400000000001,79.111199999999997,78.891400000000004,78.813000000000002,79.275899999999993,79.035399999999996,78.915000000000006,79.149100000000004,78.569000000000003,78.989699999999999,78.992099999999994,78.946100000000001,79.267499999999998,78.892300000000006,78.832700000000003,79.122,79.135800000000003,78.864599999999996,78.920699999999997,78.948999999999998,78.985900000000001,78.8352,78.908199999999994,78.969399999999993]
[null,null,null,"CRI, TCS2",94.025999999999996,93.976799999999997,93.960800000000006,94.077299999999994,93.895300000000006,93.947599999999994,93.940200000000004,94.059399999999997,94.133700000000005,94.050399999999996,93.989500000000007,94.0809,94.087900000000005,94.067400000000006,94.0214,93.895899999999997,93.656400000000005,94.017899999999997,93.908799999999999,93.7483,93.933400000000006,93.693700000000007,93.934899999999999,93.811400000000006,94.022400000000005,94.0762,93.934899999999999,93.864599999999996,94.099100000000007,94.138999999999996,93.895899999999997,93.911799999999999,93.798599999999993,93.941800000000001,93.741100000000003,93.749200000000002,94.041300000000007]
[null,null,null,"CRI, TCS3",88.468800000000002,88.534000000000006,88.438999999999993,88.3185,88.584999999999994,88.596699999999998,88.276300000000006,88.221800000000002,88.357500000000002,88.345299999999995,88.574399999999997,88.2667,88.225099999999998,88.489800000000002,88.413899999999998,88.490300000000005,88.9435,88.457400000000007,88.520799999999994,88.752499999999998,88.694599999999994,88.247900000000001,88.503799999999998,88.581299999999999,88.133499999999998,88.497600000000006,88.314899999999994,88.489400000000003,88.323599999999999,88.2316,88.374300000000005,88.376499999999993,88.66,88.476500000000001,88.556100000000001,88.597399999999993,88.261799999999994]
[null,null,null,"CRI, TCS4",73.864000000000004,74.227400000000003,73.965599999999995,74.247200000000007,73.994799999999998,74.180999999999997,73.839600000000004,73.869100000000003,74.170400000000001,73.841499999999996,74.075900000000004,74.039199999999994,73.972399999999993,74.098600000000005,74.004199999999997,73.773099999999999,73.656199999999998,74.232900000000001,73.823899999999995,73.723799999999997,74.079800000000006,73.455799999999996,73.94,74.014799999999994,73.8292,74.355800000000002,73.752799999999993,73.674700000000001,73.943799999999996,73.998000000000005,73.786900000000003,73.774900000000002,73.929900000000004,73.786100000000005,73.752399999999994,73.825999999999993,73.706199999999995]
[null,null,null,"CRI, TCS5",79.621300000000005,79.769000000000005,79.605900000000005,79.882099999999994,79.557400000000001,79.703400000000002,79.517099999999999,79.628600000000006,79.863100000000003,79.596199999999996,79.678299999999993,79.737200000000001,79.710700000000003,79.752499999999998,79.688299999999998,79.434799999999996,79.1952,79.8202,79.523399999999995,79.336699999999993,79.665700000000001,79.129400000000004,79.547899999999998,79.522900000000007,79.598399999999998,79.914100000000005,79.469399999999993,79.3536,79.698800000000006,79.765199999999993,79.445899999999995,79.4803,79.462500000000006,79.498199999999997,79.334100000000007,79.417599999999993,79.554299999999998]
[null,null,null,"CRI, TCS6",94.989599999999996,95.151300000000006,95.081000000000003,95.28,95.004599999999996,95.050899999999999,95.048299999999998,95.117099999999994,95.233500000000006,95.099100000000007,95.006,95.209599999999995,95.227400000000003,95.119799999999998,95.146299999999997,94.925399999999996,94.600499999999997,95.195899999999995,94.907700000000006,94.843299999999999,95.031300000000002,94.867400000000004,94.988600000000005,94.972999999999999,95.234300000000005,95.189300000000003,95.016099999999994,94.840800000000002,95.145899999999997,95.172300000000007,94.910399999999996,94.950599999999994,94.822100000000006,95.000100000000003,94.857600000000005,94.817499999999995,95.040999999999997]
[null,null,null,"CRI, TCS7",76.408699999999996,76.465599999999995,76.346599999999995,76.443600000000004,76.396000000000001,76.499099999999999,76.229900000000001,76.189499999999995,76.391499999999994,76.277000000000001,76.453800000000001,76.244500000000002,76.235299999999995,76.4148,76.378500000000003,76.304199999999994,76.557000000000002,76.4803,76.485299999999995,76.510099999999994,76.621099999999998,76.134699999999995,76.310400000000001,76.444299999999998,76.170599999999993,76.495800000000003,76.226799999999997,76.274900000000002,76.271299999999997,76.274299999999997,76.261499999999998,76.3416,76.478700000000003,76.325199999999995,76.384699999999995,76.604500000000002,76.290700000000001]
[null,null,null,"CRI, TCS8",50.27,50.1965,50.0779,50.3765,50.075000000000003,50.304000000000002,49.883699999999997,49.948,50.421900000000001,50.143099999999997,50.358600000000003,50.063499999999998,50.069800000000001,50.314999999999998,50.231400000000001,49.940300000000001,50.180300000000003,50.312800000000003,50.347799999999999,50.177100000000003,50.506900000000002,49.444899999999997,49.980400000000003,50.103700000000003,49.902799999999999,50.428800000000003,49.936,49.955500000000001,50.174599999999998,50.240400000000001,49.9236,50.125900000000001,50.156599999999997,50.084299999999999,49.9375,50.395000000000003,50.079500000000003]
[null,null,null,"CRI, TCS9",-4.1215599999999997,-4.26356,-4.2373799999999999,-3.47078,-4.1456999999999997,-3.6416599999999999,-4.3023800000000003,-3.90307,-2.97403,-3.5834999999999999,-3.2215400000000001,-3.8218200000000002,-3.8228200000000001,-3.5492499999999998,-3.7850299999999999,-4.5558300000000003,-4.4441499999999996,-4.0375100000000002,-4.2203200000000001,-4.56393,-3.6893199999999999,-5.5737300000000003,-4.31243,-4.0903499999999999,-4.1576199999999996,-3.2235,-4.0595400000000001,-4.06724,-3.5041600000000002,-3.3655499999999998,-4.1565000000000003,-3.8921700000000001,-4.1054500000000003,-4.1765499999999998,-4.9470200000000002,-4.1110100000000003,-4.62087]
[null,null,null,"CRI, TCS10",87.359300000000005,87.387900000000002,87.348500000000001,87.740200000000002,87.182699999999997,87.316299999999998,87.401600000000002,87.632800000000003,87.774900000000002,87.5471,87.354699999999994,87.661199999999994,87.694400000000002,87.503,87.491500000000002,87.149500000000003,86.493799999999993,87.516300000000001,87.166600000000003,86.773300000000006,87.160600000000002,86.953100000000006,87.256900000000002,87.105999999999995,87.662899999999993,87.638999999999996,87.349800000000002,87.085599999999999,87.626400000000004,87.753600000000006,87.260800000000003,87.290800000000004,86.966399999999993,87.238500000000002,86.905500000000004,86.955299999999994,87.477900000000005]
[null,null,null,"CRI, TCS11",72.618200000000002,73.284999999999997,72.911900000000003,73.366200000000006,72.932900000000004,73.1631,72.781800000000004,72.714799999999997,73.159000000000006,72.687799999999996,72.934600000000003,73.043300000000002,72.997699999999995,73.018500000000003,72.967299999999994,72.605900000000005,72.337599999999995,73.368499999999997,72.703699999999998,72.546800000000005,72.933000000000007,72.360399999999998,72.861800000000002,73.016499999999994,72.844700000000003,73.376800000000003,72.601600000000005,72.394599999999997,72.816400000000002,72.9255,72.639600000000002,72.602400000000003,72.775800000000004,72.615799999999993,72.732399999999998,72.736099999999993,72.543099999999995]
[null,null,null,"CRI, TCS12",77.694900000000004,77.813900000000004,77.5745,78.190399999999997,77.334199999999996,77.570499999999996,77.529799999999994,78.157899999999998,77.865600000000001,77.587699999999998,77.488699999999994,77.743200000000002,77.598299999999995,77.6875,77.485600000000005,77.081199999999995,76.010199999999998,76.989199999999997,76.411900000000003,76.377899999999997,77.492599999999996,76.725200000000001,77.201700000000002,77.161600000000007,77.825599999999994,78.291499999999999,77.395499999999998,77.051100000000005,77.5869,77.804299999999998,77.278999999999996,77.228499999999997,76.931700000000006,77.070999999999998,76.395799999999994,76.480599999999995,77.0959]
[null,null,null,"CRI, TCS13",82.881799999999998,82.955399999999997,82.823899999999995,82.99,82.782600000000002,82.886899999999997,82.693100000000001,82.784999999999997,83.029499999999999,82.810100000000006,82.8733,82.928700000000006,82.906499999999994,82.970399999999998,82.904300000000006,82.702500000000001,82.558499999999995,83.037300000000002,82.821299999999994,82.669399999999996,82.903899999999993,82.356899999999996,82.788799999999995,82.712999999999994,82.774199999999993,83.027799999999999,82.679199999999994,82.613799999999998,82.925299999999993,82.956299999999999,82.6447,82.686999999999998,82.686700000000002,82.777799999999999,82.608699999999999,82.643600000000006,82.821600000000004]
[null,null,null,"CRI, TCS14",94.006600000000006,94.027500000000003,93.981499999999997,93.896299999999997,94.072800000000001,94.088099999999997,93.888900000000007,93.865799999999993,93.951999999999998,93.934600000000003,94.099699999999999,93.908500000000004,93.873599999999996,94.038499999999999,93.970500000000001,94.020399999999995,94.274199999999993,93.988,94.022199999999998,94.155000000000001,94.143799999999999,93.838899999999995,94.037700000000001,94.069800000000001,93.788799999999995,94.028199999999998,93.923100000000005,94.042699999999996,93.946899999999999,93.890699999999995,93.959900000000005,93.950900000000004,94.124099999999999,94.016800000000003,94.031800000000004,94.032700000000006,93.858099999999993]
[null,null,null,"CRI, TCS15",69.371600000000001,69.280900000000003,69.213200000000001,69.440200000000004,69.2239,69.408100000000005,69.168899999999994,69.354299999999995,69.611599999999996,69.380799999999994,69.555499999999995,69.369799999999998,69.356899999999996,69.484499999999997,69.365499999999997,69.135900000000007,69.046899999999994,69.383399999999995,69.243899999999996,69.053799999999995,69.403899999999993,68.650700000000001,69.208200000000005,69.189700000000002,69.1374,69.595699999999994,69.204899999999995,69.211200000000005,69.470699999999994,69.527100000000004,69.216200000000001,69.268199999999993,69.242900000000006,69.238500000000002,68.931700000000006,69.114500000000007,69.240700000000004]
[null,null,null,"Irradiance [W/m²]",0.15962100000000001,0.18751799999999999,0.215971,0.242725,0.264739,0.28280699999999998,0.29624099999999998,0.30519499999999999,0.31040800000000002,0.31135499999999999,0.30940299999999998,0.30482999999999999,0.295711,0.28384599999999999,0.26554100000000003,0.24326100000000001,0.21569099999999999,0.189583,0.16202800000000001,0.163269,0.19277,0.21724599999999999,0.24263399999999999,0.26348500000000002,0.28064,0.29463800000000001,0.30260500000000001,0.30670399999999998,0.311448,0.30893700000000002,0.29922199999999999,0.28619,0.26740399999999998,0.242564,0.215782,0.187727,0.15895799999999999]
[null,null,null,"Illuminance [lx]",52.797899999999998,61.987200000000001,71.194599999999994,79.976600000000005,87.441800000000001,93.320499999999996,97.521299999999997,100.34699999999999,102.021,102.46299999999999,101.95399999999999,100.46299999999999,97.674599999999998,93.631399999999999,87.576800000000006,80.386399999999995,71.845500000000001,62.716799999999999,53.812100000000001,54.282200000000003,63.656300000000002,72.119,80.265600000000006,87.141300000000001,92.688199999999995,96.972899999999996,99.663899999999998,101.33199999999999,102.423,101.44499999999999,98.494299999999996,94.484200000000001,88.355900000000005,80.361999999999995,71.726799999999997,62.170200000000001,52.601599999999998]
[null,null,null,"Radiant flux [W]",0,0,0,0,0,0,0,0,0,0,0,0,0,0,0,0,0,0,0,0,0,0,0,0,0,0,0,0,0,0,0,0,0,0,0,0,0]
[null,null,null,"Luminous flux [lm]",0,0,0,0,0,0,0,0,0,0,0,0,0,0,0,0,0,0,0,0,0,0,0,0,0,0,0,0,0,0,0,0,0,0,0,0,0]
[null,"Measurement","Capture time","Begin","2018-08-15T12:23:15","2018-08-15T12:23:24","2018-08-15T12:23:31","2018-08-15T12:23:38","2018-08-15T12:23:45","2018-08-15T12:23:52","2018-08-15T12:23:59","2018-08-15T12:24:06","2018-08-15T12:24:13","2018-08-15T12:24:20","2018-08-15T12:24:27","2018-08-15T12:24:34","2018-08-15T12:24:41","2018-08-15T12:24:48","2018-08-15T12:24:55","2018-08-15T12:25:02","2018-08-15T12:25:09","2018-08-15T12:25:16","2018-08-15T12:25:23","2018-08-15T12:25:39","2018-08-15T12:25:46","2018-08-15T12:25:53","2018-08-15T12:26:00","2018-08-15T12:26:08","2018-08-15T12:26:15","2018-08-15T12:26:22","2018-08-15T12:26:29","2018-08-15T12:26:37","2018-08-15T12:26:44","2018-08-15T12:26:52","2018-08-15T12:26:59","2018-08-15T12:27:06","2018-08-15T12:27:13","2018-08-15T12:27:21","2018-08-15T12:27:28","2018-08-15T12:27:35","2018-08-15T12:27:42"]
[null,null,null,"End","2018-08-15T12:23:19","2018-08-15T12:23:27","2018-08-15T12:23:34","2018-08-15T12:23:41","2018-08-15T12:23:48","2018-08-15T12:23:55","2018-08-15T12:24:02","2018-08-15T12:24:09","2018-08-15T12:24:16","2018-08-15T12:24:23","2018-08-15T12:24:30","2018-08-15T12:24:37","2018-08-15T12:24:44","2018-08-15T12:24:51","2018-08-15T12:24:58","2018-08-15T12:25:05","2018-08-15T12:25:12","2018-08-15T12:25:19","2018-08-15T12:25:26","2018-08-15T12:25:42","2018-08-15T12:25:49","2018-08-15T12:25:56","2018-08-15T12:26:03","2018-08-15T12:26:11","2018-08-15T12:26:18","2018-08-15T12:26:25","2018-08-15T12:26:32","2018-08-15T12:26:40","2018-08-15T12:26:47","2018-08-15T12:26:55","2018-08-15T12:27:02","2018-08-15T12:27:09","2018-08-15T12:27:16","2018-08-15T12:27:24","2018-08-15T12:27:31","2018-08-15T12:27:38","2018-08-15T12:27:45"]
[null,null,"Signal level [0...1]",null,0.31925399999999998,0.35843999999999998,0.39490999999999998,0.42814400000000002,0.46262999999999999,0.48094100000000001,0.50343300000000002,0.51912000000000003,0.52519300000000002,0.52394200000000002,0.51481699999999997,0.51615999999999995,0.50230399999999997,0.48909000000000002,0.46485799999999999,0.43324099999999999,0.38935500000000001,0.36921300000000001,0.320627,0.32532699999999998,0.35932500000000001,0.39863300000000002,0.43556,0.46153100000000002,0.49021900000000002,0.50169399999999997,0.51319899999999996,0.51493900000000004,0.52531499999999998,0.51701399999999997,0.51207000000000003,0.49143999999999999,0.46733000000000002,0.43348500000000001,0.39762599999999998,0.345225,0.31937599999999999]
[null,null,"Board temperature",null,-300,-300,-300,-300,-300,-300,-300,-300,-300,-300,-300,-300,-300,-300,-300,-300,-300,-300,-300,-300,-300,-300,-300,-300,-300,-300,-300,-300,-300,-300,-300,-300,-300,-300,-300,-300,-300]
[]
[null,null,null,"Wavelength","Irradiance"]
[null,null,null,"nm","W / (m² x nm)"]
[null,null,null,380,9.8169600000000003E-5,-7.6499800000000002E-5,6.3064499999999999E-5,-1.20975E-4,-1.1671E-6,-6.7136699999999997E-5,-2.3269600000000001E-6,-4.4075100000000001E-5,-4.1994599999999999E-5,-5.53481E-5,-2.3470300000000001E-5,-1.92027E-4,-5.8106599999999997E-5,2.4390900000000001E-5,-1.34846E-5,4.8965799999999998E-5,1.9866800000000001E-5,5.6001900000000003E-5,-5.3644899999999999E-5,-1.7674500000000002E-5,6.1525999999999993E-5,-6.1312100000000005E-5,-7.2687299999999998E-5,-1.14393E-4,-1.7474299999999999E-4,-5.57255E-5,-1.02573E-4,1.1802999999999999E-6,-1.15062E-4,2.48357E-5,-7.1731799999999996E-6,-2.1490699999999999E-6,-3.5298600000000001E-5,-5.7813299999999998E-5,9.1323200000000003E-6,-9.8396700000000006E-5,-7.3830299999999997E-5]
[null,null,null,381,-2.0910500000000001E-4,-2.2494600000000001E-4,-9.4083600000000002E-5,-1.80729E-4,-2.9318999999999998E-4,-1.5789600000000001E-4,-1.8677E-4,-1.6127200000000001E-4,-1.30696E-4,-2.6001799999999999E-4,-2.6345999999999997E-4,-2.1392699999999999E-4,-3.0787000000000002E-4,-2.4747400000000002E-4,-1.44148E-4,-1.5677099999999999E-4,-2.37743E-4,-1.93702E-4,-2.0522800000000001E-4,-1.64332E-4,-2.2233999999999999E-4,-1.8087800000000001E-4,-2.9876000000000002E-4,-3.1638700000000001E-4,-2.8271200000000001E-4,-3.0706100000000002E-4,-2.1189599999999999E-4,-2.6381100000000003E-4,-1.8983100000000001E-4,-2.00729E-4,-1.6721699999999999E-4,-2.3479800000000001E-4,-3.0149799999999998E-4,-2.22356E-4,-1.6708399999999999E-4,-2.6245799999999997E-4,-1.70791E-4]
[null,null,null,382,-1.7295400000000001E-4,-1.96963E-4,-9.7110300000000004E-5,-1.1461899999999999E-4,-8.3576299999999995E-5,-2.0522300000000001E-4,-1.0746700000000001E-4,-1.5294000000000001E-4,-1.43979E-4,-1.7512699999999999E-4,-1.7382199999999999E-4,-1.48658E-4,-1.59803E-4,-1.7937000000000001E-4,-1.7688099999999999E-4,-1.43571E-4,-2.14973E-4,-1.8747499999999999E-4,-8.65021E-5,-1.7597199999999999E-4,-1.8024E-4,-9.0625599999999995E-5,-1.2881000000000001E-4,-2.3227400000000001E-4,-1.02892E-4,-1.30023E-4,-4.8315200000000001E-5,-1.8092499999999999E-4,-2.0410299999999999E-4,-9.56869E-5,-1.4960599999999999E-4,-1.7197800000000001E-4,-1.11234E-4,-9.5618999999999994E-5,-1.08903E-4,-1.77314E-4,-1.3447900000000001E-4]
[null,null,null,383,-1.0056999999999999E-4,-9.2318599999999994E-5,-3.7333899999999998E-5,-4.0753400000000002E-5,2.9353099999999999E-5,-5.0124199999999997E-5,-1.0739900000000001E-4,-7.8548599999999995E-5,-1.0068099999999999E-4,-7.5695299999999993E-5,-1.4339100000000001E-4,-1.57021E-4,-9.1227499999999993E-5,-3.97514E-5,-7.2339499999999994E-5,-1.10058E-4,-1.2288699999999999E-4,-5.9806799999999998E-5,-4.5486499999999999E-5,-1.30861E-5,-9.9752299999999997E-5,-7.4874699999999997E-5,-4.5804600000000002E-6,-1.0686799999999999E-4,-1.10042E-4,1.60189E-5,-3.0421900000000001E-5,-1.03162E-4,-1.4409299999999999E-5,-1.0751000000000001E-4,-5.5226399999999997E-5,-2.4025100000000001E-5,-2.4034699999999999E-5,-2.0064999999999998E-5,-4.9802999999999997E-5,-6.6394400000000003E-5,1.61811E-5]
[null,null,null,384,7.8384899999999996E-5,6.8615999999999995E-5,1.1742E-4,1.1717700000000001E-4,1.05962E-4,6.7518400000000001E-5,1.8516499999999999E-4,6.6536499999999996E-5,2.9180299999999999E-5,9.00964E-5,1.23805E-4,9.2365400000000002E-5,1.27737E-4,1.1171399999999999E-4,7.5593200000000007E-5,1.1858600000000001E-4,1.01501E-4,1.13002E-4,1.2846099999999999E-4,1.1457500000000001E-4,1.6208499999999999E-4,4.7293599999999997E-5,2.3852899999999999E-4,1.46642E-4,1.1171399999999999E-4,1.24387E-4,1.3578599999999999E-4,1.58918E-4,1.2977999999999999E-4,1.72941E-4,8.8059400000000006E-5,1.2162100000000001E-4,1.85677E-4,1.07608E-4,1.15889E-4,8.8956500000000001E-5,1.1927200000000001E-4]
[null,null,null,385,-2.58803E-5,-4.9304700000000001E-7,1.8404099999999999E-5,-1.1296400000000001E-5,3.4731099999999997E-5,-1.2500600000000001E-6,-2.9561E-5,3.7928900000000002E-5,2.9725599999999999E-5,-2.9974299999999999E-5,5.7329599999999997E-6,5.0161699999999998E-5,-3.5184300000000001E-5,-2.9466299999999999E-5,5.9670699999999996E-6,1.3991200000000001E-5,-4.5224899999999996E-6,-6.9666300000000001E-5,-1.67005E-5,-2.0071799999999999E-6,-3.2943E-5,1.1874300000000001E-5,-1.51167E-5,3.43785E-7,-7.1812999999999998E-5,-4.8089500000000001E-5,5.5177399999999998E-5,-3.0691500000000003E-5,-8.0932899999999999E-5,-8.9634299999999997E-5,1.8334399999999998E-5,4.4380700000000004E-6,-5.7299000000000001E-5,-4.0807599999999999E-5,5.0705300000000004E-6,-7.5792700000000004E-5,-6.7688900000000002E-5]
[null,null,null,386,3.1075899999999998E-5,-4.2238099999999998E-5,-1.01366E-5,-1.80958E-5,-1.50315E-5,-5.3595699999999999E-5,-4.6063699999999997E-5,-2.21673E-5,-7.7618400000000002E-5,-5.9516499999999998E-5,-3.9230599999999997E-5,2.42175E-5,-8.6269399999999998E-5,-7.2710499999999994E-5,-3.5247999999999999E-5,-3.5072199999999999E-5,-3.49335E-5,-4.6932699999999999E-5,-7.4667700000000003E-5,-3.2555200000000003E-5,9.9472099999999992E-6,-4.8750700000000001E-5,-4.8322300000000003E-5,-3.0969900000000003E-5,-8.4325800000000005E-5,-3.5223199999999998E-5,-5.3035399999999997E-5,-6.6488200000000005E-5,-7.1704000000000003E-5,-8.6163399999999996E-5,-6.9067399999999995E-5,-7.3440899999999997E-5,-1.0938E-4,-7.1420899999999999E-5,-4.5717799999999998E-5,-8.1393500000000006E-5,-9.5374699999999993E-5]
[null,null,null,387,8.8572600000000006E-5,3.4877299999999999E-5,7.1767900000000001E-5,3.1536299999999998E-5,2.1670000000000001E-5,2.3459799999999999E-5,4.2684700000000001E-5,7.2790699999999994E-5,1.95557E-5,8.4603800000000005E-5,3.3334499999999997E-5,8.1899399999999997E-5,-1.10101E-5,4.05518E-5,6.4494700000000004E-5,1.0363500000000001E-4,4.7411599999999999E-5,1.1615E-4,2.5685800000000001E-5,7.1930700000000006E-5,9.2615900000000002E-5,5.37875E-5,6.6914400000000003E-6,1.2332000000000001E-4,2.0977900000000001E-5,6.6911900000000006E-5,3.73406E-5,6.7548599999999999E-5,5.9317700000000003E-5,6.8157299999999999E-5,4.4116200000000003E-5,8.3818600000000004E-5,4.8647299999999998E-5,5.32439E-5,2.2399699999999998E-5,4.7401899999999998E-5,7.2506899999999995E-5]
[null,null,null,388,6.5167300000000002E-5,5.5032599999999999E-5,3.8443799999999999E-5,4.0492099999999998E-5,-2.5003100000000001E-5,1.4197599999999999E-5,1.02854E-4,3.5874499999999997E-5,-1.6558800000000001E-5,4.7858899999999997E-5,9.0477799999999996E-5,-9.1095300000000002E-6,-6.2350500000000006E-5,4.5783400000000001E-6,7.9524199999999993E-5,8.2830000000000005E-5,5.6175699999999998E-5,7.2026299999999999E-5,4.43712E-5,1.03428E-5,9.1495499999999998E-5,2.4900199999999999E-5,8.9398400000000001E-5,5.1801900000000003E-5,5.2819299999999998E-5,3.4532700000000002E-5,6.2499500000000002E-6,2.4150599999999999E-5,1.1517E-4,3.2681100000000001E-5,8.0753600000000006E-5,7.8671500000000001E-5,5.3361E-5,4.9824699999999997E-5,2.5117600000000002E-5,4.0033000000000001E-5,7.5513799999999995E-5]
[null,null,null,389,4.2887199999999998E-5,6.7402000000000003E-5,5.0099300000000003E-5,6.1267000000000001E-6,-4.5419500000000001E-5,4.7482299999999998E-5,3.2203799999999998E-5,1.2310200000000001E-7,1.1783200000000001E-4,3.0048799999999999E-5,-1.27386E-5,-2.2413400000000001E-5,8.1557000000000005E-5,1.1422300000000001E-5,9.9482700000000002E-5,2.3252300000000001E-5,2.8163000000000001E-5,3.9962400000000002E-5,6.0035999999999999E-5,4.2771900000000003E-5,5.66339E-5,4.9345000000000003E-5,2.1805199999999999E-5,-1.4885899999999999E-5,5.6326000000000002E-5,-1.04525E-5,2.74781E-5,-1.9088599999999998E-6,5.1830899999999999E-5,4.88678E-5,9.3709999999999996E-5,3.8522999999999997E-5,-1.9304E-5,1.11051E-4,6.7355799999999996E-5,7.8193099999999995E-5,4.9460399999999998E-5]
[null,null,null,390,-4.0237600000000002E-5,-3.44151E-7,1.02034E-5,9.3108700000000005E-6,9.4874600000000008E-6,3.6862700000000002E-5,-5.9037599999999999E-5,2.0406799999999999E-5,-4.2126799999999998E-5,2.0542000000000001E-5,-4.6377600000000001E-5,1.8881499999999999E-5,-7.7080400000000001E-5,-4.0055600000000003E-5,-3.9908299999999999E-5,-7.0441199999999999E-5,-1.79539E-7,-2.5356899999999999E-6,-3.8365699999999998E-5,-4.61112E-5,-3.5765900000000003E-5,4.2830200000000002E-5,-6.8983E-5,-9.8142500000000001E-6,-8.83811E-5,-5.5259200000000001E-5,-2.20128E-5,1.44661E-5,-7.4874499999999998E-6,2.3167E-5,-3.4186600000000001E-6,-2.8396400000000001E-5,-4.8381699999999998E-5,-6.0663399999999999E-5,-3.6447099999999999E-5,5.2024899999999997E-5,1.6355399999999999E-5]
[null,null,null,391,-5.1106500000000003E-5,-8.8090600000000007E-5,-3.48316E-5,-6.2333600000000002E-5,-7.7669600000000006E-5,-8.4353999999999999E-5,-2.8460099999999999E-5,-8.0762700000000005E-5,-6.3522599999999994E-5,-4.0438999999999997E-5,-4.8358E-5,-9.1837700000000003E-5,-4.0713500000000002E-5,-5.5080900000000003E-5,-2.9456799999999999E-5,-1.1931599999999999E-5,-9.9344000000000003E-5,-6.5589300000000006E-5,-5.3449499999999997E-5,-8.1124800000000001E-7,-4.4061899999999999E-5,-3.8907299999999999E-5,-7.9844800000000005E-5,-2.87189E-5,-4.3103699999999999E-5,-5.9125100000000001E-5,-5.3564899999999999E-5,-6.4333900000000004E-5,-1.60679E-6,-1.0233700000000001E-4,-3.2341800000000003E-5,-8.6116600000000001E-5,-1.6995199999999999E-6,-9.8598999999999996E-5,-8.5733600000000002E-5,-4.3470899999999997E-5,-7.3754699999999994E-5]
[null,null,null,392,3.7635800000000003E-5,3.9916100000000002E-5,2.7808199999999999E-5,-5.4681500000000003E-6,-4.4152599999999996E-6,4.5283700000000001E-5,8.49538E-5,2.1354099999999999E-5,7.0777699999999998E-6,3.1110099999999999E-5,-9.7671800000000006E-6,-1.8984600000000001E-5,5.8788700000000002E-5,2.1202100000000002E-5,4.1588300000000003E-5,3.19418E-5,-2.8317999999999999E-5,1.5698100000000001E-5,3.8105200000000002E-5,4.8087100000000002E-5,-6.8542499999999996E-6,4.7416500000000002E-5,6.1097799999999998E-6,2.5840899999999999E-5,2.8919299999999999E-5,3.54896E-5,2.1392100000000001E-5,3.8353399999999998E-5,3.70904E-5,2.4705199999999999E-5,1.22531E-5,1.8036499999999999E-5,2.48819E-5,3.7774400000000002E-5,6.0740900000000001E-6,3.7454699999999999E-5,1.9391299999999998E-5]
[null,null,null,393,-4.2122200000000001E-5,-5.5928899999999999E-5,-3.3185200000000002E-5,-7.8940299999999994E-5,-4.1624E-5,-6.7903099999999997E-5,-5.5971000000000003E-5,-1.219E-5,-5.0305200000000001E-5,8.4772900000000003E-6,-6.2651500000000001E-5,-5.3844800000000003E-5,-5.7105499999999997E-5,-6.5586999999999994E-5,-3.7987000000000001E-5,-5.82408E-5,-4.4978600000000003E-5,-1.7697400000000001E-5,-5.3956899999999998E-5,-4.5969500000000001E-5,-7.1205799999999995E-5,-7.2202300000000005E-5,-6.4446899999999994E-5,-9.0414100000000002E-6,-4.81847E-5,-3.2548200000000001E-5,-6.5422300000000005E-5,-6.7918500000000004E-5,-7.8621400000000006E-5,-3.9313500000000001E-6,-5.2791499999999998E-5,-2.0976300000000001E-5,-6.4250600000000004E-5,-1.14367E-5,-7.6422399999999995E-5,-4.23752E-5,-5.7784600000000002E-5]
[null,null,null,394,2.1683099999999999E-5,-1.5960600000000001E-5,4.8723900000000003E-5,2.6540300000000001E-5,5.9624299999999998E-5,3.3865500000000003E-5,1.43945E-6,-1.7391300000000001E-5,1.2997799999999999E-5,4.4235800000000001E-5,1.7928299999999999E-5,-3.1698499999999998E-6,-1.4379700000000001E-5,1.2599499999999999E-6,3.9165200000000002E-5,4.7261E-5,8.1576600000000004E-6,4.9655299999999999E-5,1.56281E-5,1.97366E-5,3.7107400000000002E-6,-3.32306E-5,-3.60181E-5,5.1557400000000002E-5,1.80942E-5,2.8507500000000001E-5,-1.43472E-5,-1.40549E-5,2.1794299999999998E-6,4.6204700000000002E-5,-1.1787099999999999E-5,2.2317300000000001E-5,-4.2886799999999997E-5,3.7257800000000001E-5,1.3705300000000001E-5,3.8136400000000003E-5,4.2521799999999997E-5]
[null,null,null,395,-6.33192E-6,1.5401599999999998E-5,5.7374899999999998E-5,3.3297899999999998E-5,8.9562200000000005E-6,-1.13871E-5,3.48252E-5,1.6390100000000001E-5,4.7234300000000003E-5,7.2495299999999997E-5,5.9163100000000003E-5,6.70699E-5,9.8146900000000004E-6,-5.2336600000000001E-6,-4.8782300000000001E-7,1.38843E-5,7.3662299999999994E-5,5.6619999999999997E-5,1.83767E-5,6.9238699999999998E-5,4.0508099999999999E-5,3.37033E-5,2.3102600000000001E-5,2.68311E-6,1.44645E-5,3.7573399999999998E-6,5.6764500000000002E-5,7.3987E-6,9.0286899999999998E-6,3.4269E-5,6.5426300000000001E-5,4.0260899999999999E-5,-4.3101800000000001E-6,-2.5412600000000001E-5,-7.3614200000000001E-6,5.5974799999999998E-5,6.5954300000000006E-5]
[null,null,null,396,-1.1120399999999999E-6,6.7410000000000003E-6,-1.5646900000000001E-5,-4.8284799999999999E-6,-4.8592099999999998E-5,-1.5607399999999999E-5,2.68455E-6,1.364E-5,-1.36005E-5,-2.0241199999999999E-5,-2.98839E-5,-5.5316099999999997E-5,3.3183699999999999E-6,-2.1790800000000001E-5,1.69228E-5,3.00446E-5,9.5408599999999993E-7,1.78188E-5,1.8153699999999999E-5,2.3500299999999999E-5,1.23368E-6,3.6802599999999999E-5,1.2828E-5,1.45929E-5,-4.7325199999999997E-6,1.0397800000000001E-5,7.3775899999999996E-6,1.27649E-5,2.9028500000000002E-5,2.12695E-6,4.0065699999999998E-5,3.3047899999999999E-5,2.82352E-5,1.0756399999999999E-5,1.76384E-5,1.6520799999999999E-5,3.7976699999999998E-5]
[null,null,null,397,-1.2526399999999999E-5,9.7707999999999997E-6,-4.9664999999999998E-6,-3.1202499999999998E-5,-5.5485000000000002E-5,-4.8537200000000003E-6,1.10546E-6,-2.2123500000000001E-7,4.2106599999999999E-6,-5.4281700000000004E-6,-1.6509300000000001E-5,-6.6082800000000002E-7,3.1001199999999997E-5,-3.1909599999999997E-5,-3.9418200000000001E-5,1.5721599999999999E-6,4.4534700000000002E-7,-4.1504300000000002E-5,-7.3115399999999996E-6,1.8261400000000001E-5,-1.04182E-5,2.6233799999999999E-5,-6.1911599999999999E-5,3.2786799999999999E-6,4.5432300000000004E-6,2.0942699999999999E-5,-4.1043499999999999E-6,-9.9483699999999995E-7,2.5483700000000001E-5,-3.34636E-6,-1.9388299999999999E-5,-1.4023699999999999E-5,-9.7491700000000002E-7,1.69504E-5,-2.8008E-5,3.4546699999999999E-5,2.0633599999999998E-5]
[null,null,null,398,6.2762000000000007E-5,8.1145399999999997E-5,2.7039999999999999E-5,4.5833E-5,5.4511899999999997E-6,2.8617699999999999E-5,5.0145000000000002E-5,1.74096E-5,4.3507899999999997E-5,2.9584700000000002E-5,1.9451599999999999E-5,9.3890999999999996E-6,2.5973E-5,2.7640500000000001E-5,2.7708E-5,4.1846800000000001E-5,4.1515E-6,2.2727699999999999E-5,1.51265E-5,7.1735099999999999E-6,6.1052500000000005E-5,6.3607000000000003E-5,3.1242599999999998E-5,3.3768699999999998E-6,2.51986E-5,3.1729600000000002E-5,7.5449699999999997E-5,3.2614100000000001E-6,4.2662900000000001E-5,3.1438600000000001E-5,8.0925299999999996E-6,4.0898900000000002E-5,2.98853E-5,3.45349E-5,1.8289999999999999E-5,3.6560799999999997E-5,7.1015399999999998E-5]
[null,null,null,399,-6.56298E-6,2.47354E-6,1.0995000000000001E-5,-7.2496799999999997E-6,-1.9281699999999999E-5,-3.51221E-5,6.96582E-6,1.82316E-5,1.91077E-5,2.64907E-5,1.2494000000000001E-6,1.4748499999999999E-6,-1.86864E-6,-1.61856E-5,8.2001499999999997E-7,1.75082E-6,2.4511499999999998E-7,2.2437199999999999E-5,1.9701300000000001E-5,7.3339199999999999E-6,-1.03681E-5,1.3317E-5,6.9186300000000003E-7,2.35792E-7,9.4528399999999998E-6,1.12219E-5,1.2543300000000001E-5,-3.3601900000000001E-5,-1.02344E-5,4.5247200000000003E-5,-1.3546999999999999E-5,-2.9304700000000001E-5,-3.7342100000000003E-5,-2.98529E-5,-1.7609899999999999E-5,4.8974199999999996E-6,3.52981E-5]
[null,null,null,400,3.6773100000000002E-5,5.5710500000000001E-5,2.15242E-5,1.32785E-5,2.2295800000000001E-5,6.0699599999999997E-5,1.9126700000000001E-5,4.7692899999999999E-5,4.2655199999999998E-5,8.6096699999999995E-6,1.2147700000000001E-5,1.6452499999999999E-5,4.5761299999999998E-5,-7.4934500000000002E-6,4.2762000000000002E-5,1.10703E-5,1.8442400000000002E-5,7.7302600000000001E-5,3.6535300000000002E-5,3.5982000000000002E-5,3.7151599999999998E-5,2.3747000000000002E-5,3.2681800000000003E-5,7.0905899999999996E-6,6.5324800000000002E-5,2.6294900000000001E-5,6.5145200000000001E-5,2.8163399999999999E-5,4.1005099999999998E-5,2.5649499999999999E-5,2.0626299999999999E-5,5.5390199999999997E-5,4.0810999999999999E-5,3.5195799999999999E-5,4.62998E-6,2.6154200000000001E-5,1.23952E-5]
[null,null,null,401,-1.6277899999999999E-5,-1.78777E-5,-8.9526600000000004E-7,6.5777300000000001E-6,-2.1762500000000001E-6,4.4376899999999999E-5,-1.12411E-5,1.7496E-5,-5.5666199999999999E-6,4.0441200000000002E-5,-1.46366E-5,2.5557700000000001E-5,5.6039999999999999E-5,-5.2115400000000003E-6,4.2425999999999997E-5,-8.6042800000000002E-6,-4.4793699999999998E-5,-2.4396099999999998E-5,3.7065099999999999E-5,-3.2860300000000001E-5,-5.3556400000000003E-6,-1.0356199999999999E-5,1.23422E-5,-5.0823199999999998E-5,-2.47305E-5,2.6171100000000001E-5,1.6416799999999998E-5,3.59617E-6,-7.1716299999999996E-6,4.8321800000000002E-5,-2.4313700000000001E-5,8.4116299999999996E-6,2.81221E-5,3.7596199999999998E-5,1.6401300000000002E-5,3.0764099999999999E-5,2.2172500000000002E-5]
[null,null,null,402,2.99719E-5,-6.7120299999999998E-6,3.1158400000000003E-5,-5.61116E-5,1.7305000000000001E-5,3.46608E-6,-2.0978999999999999E-6,-3.3000499999999997E-5,3.0484299999999999E-6,1.5948500000000002E-5,-4.5057699999999997E-6,-1.7765899999999999E-5,3.3672600000000002E-7,-1.63018E-6,-3.7165400000000002E-5,-4.8881799999999997E-5,7.3416000000000001E-6,7.0411999999999996E-6,-3.2428500000000003E-5,-3.2494399999999998E-5,6.00495E-6,-1.8003899999999999E-5,-1.2282900000000001E-6,1.30729E-5,-5.7580599999999997E-6,-1.6562299999999999E-5,-6.62219E-6,-1.4840999999999999E-6,-1.3521400000000001E-5,-3.2366100000000002E-5,-1.44096E-5,-6.0749099999999999E-6,3.2424400000000001E-5,9.8111899999999995E-6,9.5183500000000001E-6,-1.35406E-5,-2.7520200000000001E-5]
[null,null,null,403,5.9036999999999997E-5,7.9896300000000003E-5,6.2787100000000001E-5,3.4699900000000003E-5,3.7793200000000003E-5,5.69336E-5,7.1122600000000002E-5,4.0864500000000002E-5,2.2633199999999999E-5,8.5514100000000002E-5,3.6925599999999998E-5,7.5402500000000002E-5,5.4063600000000002E-5,6.5155900000000004E-5,5.2089699999999997E-5,6.2014500000000001E-5,2.5395600000000001E-5,6.5594199999999996E-5,5.2054600000000001E-5,5.7775200000000002E-5,5.3189799999999997E-5,3.74086E-5,5.70665E-5,2.1588400000000002E-5,4.9780800000000003E-5,3.2781899999999999E-5,8.0130500000000001E-5,4.7907500000000002E-5,4.4558000000000003E-5,8.2167299999999995E-5,5.5987299999999998E-5,5.99868E-5,3.4752500000000003E-5,5.5362299999999997E-5,7.4084099999999998E-5,3.6720800000000003E-5,5.8349900000000002E-5]
[null,null,null,404,2.3051400000000001E-5,5.5566699999999998E-5,4.9871699999999999E-5,5.3811999999999999E-5,8.7075400000000003E-6,5.8110299999999998E-5,2.4279099999999999E-5,4.9670399999999998E-5,7.4412099999999999E-5,8.1606299999999998E-5,3.4879999999999998E-5,5.3594599999999997E-5,2.8386099999999999E-5,6.9687100000000006E-5,4.1981399999999998E-5,5.3254699999999997E-5,6.6137399999999995E-5,9.4603300000000003E-6,4.7879600000000001E-5,5.1566200000000001E-5,8.7606800000000003E-5,2.9835099999999998E-5,1.57146E-5,2.40816E-5,4.0975300000000001E-5,2.6371900000000001E-5,6.8528000000000005E-5,4.0065699999999998E-5,2.40154E-5,3.6158000000000002E-5,2.38624E-5,5.0238100000000003E-5,8.6955699999999998E-6,3.9154199999999999E-5,7.3975500000000003E-5,4.91211E-5,7.5816500000000002E-5]
[null,null,null,405,6.84979E-5,9.39406E-5,8.7980300000000002E-5,7.3089000000000004E-5,1.27644E-4,9.6282399999999998E-5,1.2052700000000001E-4,8.9814099999999998E-5,1.3257899999999999E-4,9.58878E-5,6.4733999999999994E-5,7.2822800000000004E-5,8.9171899999999999E-5,9.88604E-5,9.6735600000000003E-5,5.76443E-5,6.2526400000000005E-5,7.6948999999999998E-5,7.6002999999999997E-5,3.4938299999999997E-5,1.2217099999999999E-4,7.84146E-5,5.0955000000000003E-5,9.03372E-5,8.2648800000000001E-5,8.9662799999999998E-5,9.0696099999999994E-5,9.0497700000000006E-5,9.1020700000000001E-5,9.71641E-5,9.6650499999999999E-5,9.3987700000000001E-5,8.5940399999999995E-5,1.0183699999999999E-4,8.6520499999999999E-5,1.23638E-4,6.7852299999999994E-5]
[null,null,null,406,-6.6572199999999999E-5,-1.2563099999999999E-4,-5.0122900000000001E-5,-6.6486E-5,-5.5358600000000002E-5,-7.4855400000000002E-5,-5.0998600000000003E-5,-4.9001300000000001E-5,-8.8022099999999999E-5,-4.4446100000000001E-5,-6.7083999999999997E-5,-1.38983E-5,-5.6754800000000001E-5,-4.2203000000000002E-5,-7.7248200000000004E-5,-3.3655000000000002E-5,-7.3105699999999994E-5,-9.3657499999999996E-5,-5.9451899999999999E-5,-1.20487E-4,-1.5935700000000001E-5,-5.12444E-5,-2.33135E-5,-1.1856799999999999E-4,-8.9723199999999995E-5,-3.57614E-5,-9.0097000000000002E-5,-8.1751599999999998E-5,-6.2167299999999997E-5,-9.5901200000000003E-5,-9.9030000000000006E-5,-4.9415800000000002E-5,-1.0538499999999999E-4,-9.3865100000000004E-5,-6.2471599999999993E-5,-6.7971499999999998E-5,-9.8597000000000005E-5]
[null,null,null,407,3.3554699999999999E-6,2.48635E-5,-1.0672900000000001E-5,2.9458099999999998E-5,3.3729200000000002E-5,2.4437E-5,7.2424600000000003E-6,2.1642899999999999E-5,2.5890699999999999E-5,1.6625699999999999E-5,9.0476499999999997E-6,5.18471E-5,2.0530399999999999E-5,2.7965899999999999E-5,3.8262900000000003E-5,1.24856E-5,1.8569599999999999E-5,-7.1196499999999998E-8,-4.3330699999999997E-6,3.16391E-5,5.0493600000000001E-5,2.8447599999999998E-5,-9.2500999999999997E-6,-2.0692499999999999E-5,3.1008399999999999E-5,-1.59723E-5,1.5777299999999999E-5,4.4994599999999998E-5,5.1722499999999998E-5,7.2275200000000004E-6,1.8054999999999999E-5,9.0476499999999997E-6,2.7517000000000001E-5,-8.5846499999999992E-6,1.7967800000000001E-5,-6.9883999999999999E-6,2.08448E-6]
[null,null,null,408,1.34614E-5,3.4868199999999999E-5,3.7290899999999999E-7,2.3417500000000001E-5,1.0583300000000001E-5,2.5862100000000001E-5,5.2170399999999998E-5,1.8108E-5,-1.3306699999999999E-5,3.4195500000000002E-5,2.2512499999999998E-5,3.95566E-5,4.9233400000000002E-5,2.3385599999999998E-5,1.9509099999999999E-5,8.4880799999999995E-6,2.1069699999999999E-5,5.30273E-5,3.4213600000000001E-5,1.38426E-5,1.3908E-5,-7.7023900000000003E-6,1.5606700000000001E-5,6.8404300000000002E-6,3.5596499999999997E-5,5.11764E-5,-4.7780800000000003E-6,4.3102999999999997E-5,3.3789399999999999E-5,7.5893E-5,1.2592700000000001E-5,2.2045500000000001E-5,4.8036800000000001E-5,8.0851800000000004E-6,3.1150199999999999E-5,4.4276000000000001E-5,-2.0408399999999999E-5]
[null,null,null,409,4.2054300000000002E-5,5.8252599999999999E-5,4.5374599999999998E-5,1.21812E-5,4.8797400000000001E-5,3.0552899999999997E-5,6.8510599999999994E-5,3.7692399999999998E-5,1.3014600000000001E-5,2.5286199999999999E-5,5.98137E-5,6.65356E-5,3.4504800000000002E-5,6.6680000000000005E-5,3.6945600000000001E-5,3.3698200000000002E-5,3.6878100000000002E-5,5.2860900000000001E-5,2.5684600000000001E-5,3.3711499999999997E-5,3.32708E-5,2.0883800000000002E-5,1.2643099999999999E-5,2.7888499999999999E-5,5.5842499999999999E-5,6.8510599999999994E-5,1.82082E-5,3.4749100000000002E-5,2.74593E-5,3.4437400000000003E-5,6.27993E-5,4.0822299999999997E-5,2.5267000000000001E-5,1.98E-5,4.1341999999999998E-5,5.2910900000000002E-5,1.01464E-5]
[null,null,null,410,-3.4338799999999997E-5,-3.8092700000000002E-5,-1.3591099999999999E-5,-5.2432699999999997E-5,-2.0718699999999999E-5,-3.7307200000000001E-5,-1.8116400000000002E-5,-3.9607200000000003E-5,7.7343700000000005E-7,-4.9818899999999998E-5,-2.91326E-5,-1.0152E-5,-3.1641799999999999E-5,-1.16775E-5,-1.28356E-5,-6.1892500000000004E-5,-4.4428999999999998E-5,-3.8102799999999997E-5,-1.54905E-5,-2.3120199999999999E-5,-2.67101E-5,-1.82268E-5,-3.51623E-5,5.9906099999999999E-7,-8.3317000000000002E-6,-1.5187E-5,-5.6633099999999998E-5,-5.1610300000000003E-5,-3.7843100000000002E-6,-8.6182100000000003E-5,-3.9812299999999998E-5,-2.6517100000000001E-5,-1.1879099999999999E-5,-3.0015500000000001E-5,-2.38622E-5,-1.49325E-5,-3.0453000000000001E-5]
[null,null,null,411,-2.6590400000000001E-6,-4.4827000000000003E-5,1.78576E-5,1.7650499999999999E-6,3.34237E-6,8.1367400000000006E-6,4.1211100000000003E-5,-1.09577E-6,3.1730499999999997E-5,-1.2106999999999999E-6,-9.2637200000000005E-6,2.28303E-6,-9.6542699999999996E-6,-2.2784599999999999E-5,-4.2717199999999998E-6,-3.4468599999999997E-5,-4.6777699999999998E-5,2.0176400000000001E-7,8.8414199999999995E-6,2.6298000000000001E-5,-2.1336200000000001E-5,2.13221E-6,1.0337600000000001E-5,1.32665E-6,2.09789E-6,2.1852599999999998E-6,-1.89315E-5,-5.2647099999999999E-5,-7.6177400000000002E-6,-2.95099E-5,-2.1999700000000001E-7,-5.39816E-6,1.9081800000000001E-5,4.0504799999999999E-5,-1.3287399999999999E-6,2.20242E-6,5.0092000000000001E-5]
[null,null,null,412,-5.1443500000000003E-5,-5.4453999999999997E-5,-5.5516400000000003E-5,-4.9666200000000002E-5,-9.1327600000000003E-5,-1.8725399999999999E-5,-5.1082999999999999E-6,-5.7436899999999999E-5,-8.1755599999999994E-5,-1.49057E-5,-5.6481099999999997E-5,-3.40092E-5,-5.56233E-5,-4.5294899999999999E-5,-7.9935699999999994E-5,-3.1185600000000002E-5,-5.1657699999999998E-5,-2.1121999999999999E-5,-1.1812599999999999E-5,-1.60017E-5,-3.86138E-5,-8.4119199999999999E-5,-4.8063499999999998E-5,-2.9781199999999999E-5,-4.39386E-5,-4.5467999999999999E-5,-5.3009900000000002E-5,-5.2579099999999999E-5,-2.1372499999999999E-5,-5.5925399999999998E-5,-4.9907700000000003E-5,-3.8176700000000003E-5,-5.2881299999999998E-5,-4.4625600000000002E-5,-5.1095699999999999E-5,-4.1893200000000001E-5,-6.3866699999999996E-5]
[null,null,null,413,1.94292E-5,5.6827900000000002E-6,2.3144799999999999E-5,4.7528999999999998E-5,1.32845E-5,-4.5772100000000003E-7,-8.9449800000000002E-6,1.3873000000000001E-5,3.0692399999999998E-5,1.0484300000000001E-5,3.5614700000000003E-5,4.5800600000000003E-5,2.34773E-5,-2.8412499999999999E-5,4.9446500000000002E-5,5.70262E-6,-3.03627E-5,2.5707500000000001E-5,4.0960600000000002E-5,1.8555000000000001E-5,1.6954499999999998E-5,-7.7665799999999998E-6,2.4708299999999999E-5,2.46041E-6,2.6838999999999998E-5,5.53296E-5,1.8245099999999999E-5,3.9809299999999998E-5,8.9263400000000002E-7,2.82846E-5,2.3907999999999999E-5,5.5446299999999998E-5,3.9107199999999997E-5,2.83926E-5,-6.0196900000000003E-6,1.02142E-5,4.6676099999999999E-5]
[null,null,null,414,3.9020799999999997E-5,-2.6235E-6,1.10783E-5,3.9075500000000002E-5,-2.3257800000000001E-6,4.6986399999999996E-6,3.8439899999999998E-5,1.39961E-5,3.4742900000000002E-5,2.2337899999999998E-5,2.4218000000000001E-5,2.2245499999999999E-5,2.7565200000000002E-5,2.5193200000000001E-5,3.2363999999999997E-5,4.34226E-5,8.1776499999999995E-6,4.8285499999999997E-5,4.3403699999999999E-5,1.7827400000000001E-5,1.8129299999999999E-5,1.02169E-5,3.1668599999999997E-5,3.8176400000000003E-5,4.7043499999999998E-5,7.1702899999999994E-5,6.1047200000000001E-5,3.4752999999999997E-5,1.1106499999999999E-5,3.88087E-5,4.42198E-5,1.34152E-5,2.2527800000000001E-5,3.4120099999999999E-5,2.9749900000000001E-5,5.6889099999999997E-5,4.5024000000000001E-5]
[null,null,null,415,2.9591600000000001E-6,7.1939800000000004E-6,-6.1262300000000003E-6,9.32004E-6,-1.47217E-5,-2.8260699999999999E-5,-5.7738300000000001E-6,3.5892500000000002E-5,-9.0461199999999994E-6,3.18239E-6,-1.6215899999999998E-5,-2.86561E-6,-2.4984800000000002E-6,-6.4808400000000001E-6,1.5474399999999999E-5,-2.48706E-6,-3.9291999999999996E-6,9.4430700000000007E-6,-4.7957100000000004E-6,-1.5263900000000001E-5,-7.1628000000000003E-6,-1.4257700000000001E-5,2.5452499999999999E-6,1.8140700000000001E-5,9.7058299999999999E-6,2.7790300000000001E-5,1.27037E-5,-9.4077100000000004E-6,-1.43072E-6,1.1306400000000001E-5,6.55155E-6,1.4628699999999999E-5,3.4660299999999999E-6,1.27059E-5,-8.8395799999999995E-6,3.2523400000000001E-5,5.07685E-5]
[null,null,null,416,-5.4850099999999999E-6,1.24811E-5,-2.3664700000000001E-5,1.3694E-5,-1.14831E-5,-1.3027000000000001E-5,-3.58822E-5,2.4551099999999999E-5,-2.8495400000000002E-5,-3.5067999999999997E-5,-2.3517899999999998E-6,-2.6022800000000001E-5,-1.4748300000000001E-5,2.29187E-7,-2.1021100000000001E-5,2.5197700000000001E-5,-2.5831400000000001E-5,-6.3605700000000002E-6,-6.5001599999999998E-6,-4.2506399999999997E-5,-3.25293E-5,-7.4420799999999997E-5,-1.5854399999999999E-5,-3.2424400000000001E-5,-5.5968299999999997E-5,-2.73158E-5,-2.2506799999999999E-5,-2.1498E-5,-1.8507499999999999E-5,-1.22834E-5,-3.0491300000000001E-5,-3.6764100000000003E-5,-1.4748300000000001E-5,-2.4321099999999999E-7,-3.4261399999999997E-5,-4.60494E-5,3.6210000000000001E-6]
[null,null,null,417,7.1209800000000004E-5,6.9300099999999997E-5,7.2712200000000005E-5,9.03992E-5,7.2690300000000004E-5,5.6929599999999998E-5,7.8521299999999996E-5,8.2048900000000007E-5,6.00644E-5,7.7470099999999995E-5,9.8760500000000004E-5,9.0994400000000004E-5,4.1649100000000001E-5,9.9219499999999994E-5,4.1956100000000003E-5,7.3963399999999997E-5,7.0395000000000006E-5,8.5072499999999996E-5,8.0264400000000004E-5,7.4111900000000004E-5,1.0417299999999999E-4,3.9581600000000001E-5,5.7991800000000003E-5,7.5459199999999997E-5,1.01797E-4,6.2556200000000003E-5,6.4280299999999995E-5,9.8874800000000004E-5,8.1378200000000006E-5,9.5106999999999996E-5,9.0321499999999999E-5,7.4622600000000006E-5,6.5494500000000001E-5,5.38464E-5,8.03277E-5,7.0581300000000001E-5,1.14104E-4]
[null,null,null,418,-8.4150100000000006E-6,2.3092099999999999E-5,1.7714400000000001E-5,1.40447E-5,1.4582399999999999E-5,2.82057E-5,2.3652300000000001E-5,3.4782300000000001E-5,8.1950800000000008E-6,1.97197E-5,9.2047300000000006E-6,3.0825499999999998E-5,3.3161899999999998E-5,2.7967199999999999E-5,2.01922E-5,2.4407399999999999E-5,1.12797E-5,5.8022500000000002E-6,-6.3183299999999997E-6,-3.8645200000000001E-5,1.3583E-5,1.8865999999999999E-5,1.2835499999999999E-5,1.5411099999999999E-5,5.3521099999999998E-5,-8.0767599999999992E-6,-5.8106099999999998E-6,-1.61535E-5,1.6096E-5,1.25362E-5,2.4921499999999998E-5,-2.36938E-5,-1.5750600000000001E-5,-4.3538900000000001E-6,2.8323999999999999E-5,-4.1293099999999999E-5,-1.07234E-5]
[null,null,null,419,2.7681100000000001E-6,3.24054E-6,-1.1537400000000001E-5,-9.5633300000000008E-6,1.2611399999999999E-5,-1.18722E-5,1.44256E-5,4.0296000000000003E-6,-8.4831099999999998E-7,-1.46669E-5,-1.63714E-5,2.2581600000000001E-5,-4.2421800000000001E-5,2.1706E-6,8.5723799999999997E-6,-1.9232299999999999E-5,-1.6535300000000001E-5,-2.5777699999999999E-5,-3.9692199999999999E-5,-3.5039400000000002E-5,5.27288E-7,-6.8347099999999998E-6,6.7102499999999998E-6,-2.0498800000000001E-5,-5.5300000000000004E-7,-1.04847E-5,-3.2765000000000002E-5,-2.0081500000000001E-5,-2.7775199999999998E-6,-1.5746299999999999E-5,-1.24139E-5,2.9941400000000001E-6,9.9580000000000002E-6,3.5756999999999997E-5,3.207E-6,-2.3425899999999999E-5,1.10505E-5]
[null,null,null,420,3.3520399999999998E-5,3.1736999999999998E-5,2.7292199999999999E-5,3.5267E-5,2.85238E-5,5.8862E-5,4.9100200000000001E-5,3.4618E-5,3.25444E-5,4.6589699999999999E-5,2.2127E-5,3.9158600000000001E-5,3.4306400000000001E-5,6.26755E-5,2.0378200000000001E-5,1.9600299999999999E-5,4.2975599999999999E-6,2.45299E-5,2.4905600000000001E-5,3.8667300000000002E-5,3.0475900000000001E-5,4.7048999999999996E-6,4.0697400000000001E-5,4.3313199999999997E-5,2.01012E-5,2.6863500000000001E-5,5.98519E-6,-5.6012499999999999E-6,3.7704499999999998E-5,1.6026900000000001E-5,4.5126000000000001E-5,3.3974899999999999E-5,3.69237E-5,3.4776400000000001E-5,3.4111900000000001E-5,1.9392600000000001E-5,4.3130500000000003E-5]
[null,null,null,421,4.4899499999999999E-5,5.8137899999999998E-5,1.49123E-5,3.10951E-5,1.0839099999999999E-5,3.6923900000000001E-5,3.79126E-5,6.2744300000000002E-5,6.5566699999999997E-5,4.3414200000000002E-5,1.10117E-5,2.9495100000000002E-5,2.14595E-5,3.7444599999999997E-5,1.6237599999999998E-5,4.63648E-5,3.0184000000000001E-5,1.18112E-5,5.7184900000000002E-5,-1.2940499999999999E-5,3.8643699999999997E-5,1.99898E-5,2.9712900000000001E-5,5.9782199999999998E-5,3.5277500000000002E-5,4.0560299999999999E-5,3.33388E-5,3.0128600000000002E-6,-2.2603300000000002E-6,3.0366100000000001E-5,3.4682199999999998E-5,2.0495900000000001E-5,1.17281E-5,2.75227E-5,1.67805E-5,2.3237199999999998E-5,4.2951300000000003E-5]
[null,null,null,422,1.13606E-4,6.7814100000000005E-5,4.7924699999999999E-5,8.0487899999999999E-5,3.4572300000000001E-5,7.1383400000000005E-5,4.3979500000000001E-5,5.6178499999999998E-5,8.4903300000000004E-5,5.6993200000000002E-5,8.6601199999999993E-5,6.5710599999999994E-5,3.08355E-5,7.3062699999999994E-5,5.5727999999999999E-5,5.0132100000000001E-5,4.8501699999999997E-5,8.2173500000000002E-6,3.5779599999999999E-5,6.6516899999999993E-5,8.7244399999999994E-5,5.9068599999999999E-5,7.6525299999999997E-5,8.7233199999999997E-5,9.29549E-5,1.26169E-4,6.2840800000000003E-5,5.6029100000000002E-5,7.7205099999999997E-5,7.7941099999999998E-5,2.9855100000000002E-5,9.9294000000000002E-5,4.7112900000000001E-5,8.4583100000000007E-5,8.8554599999999994E-5,3.6100999999999999E-5,9.4379699999999994E-5]
[null,null,null,423,1.9913599999999999E-5,1.6808900000000001E-5,5.7537400000000002E-5,2.1112999999999999E-5,1.7681099999999999E-5,-6.6309499999999996E-6,5.1823000000000002E-5,3.9398699999999999E-5,1.29013E-5,-4.3167200000000002E-6,1.7370399999999999E-5,-3.6331500000000003E-5,2.8214000000000001E-5,6.1332600000000003E-5,5.4864000000000002E-5,1.25547E-5,6.6003400000000002E-7,8.7372100000000007E-6,-1.91094E-5,1.82732E-5,-3.3155100000000001E-6,-2.4094400000000001E-5,2.4814E-5,1.1773999999999999E-5,-1.25104E-5,4.5997700000000002E-5,2.90183E-5,2.1418000000000001E-5,2.4562999999999998E-5,4.3352000000000001E-5,2.3294200000000001E-5,7.6227800000000002E-8,1.35614E-5,-5.8380599999999998E-7,-4.4927499999999998E-7,2.2559299999999999E-5,1.1220700000000001E-5]
[null,null,null,424,2.6029499999999999E-5,1.88205E-5,5.3336099999999999E-5,6.1600199999999993E-5,3.4421900000000003E-5,2.1347300000000001E-5,3.7802400000000002E-5,2.5624999999999999E-5,7.9533500000000007E-6,8.3652099999999998E-5,5.0089200000000001E-5,2.4437999999999999E-5,5.0877100000000001E-5,4.6781399999999999E-5,2.1467E-5,2.44849E-5,1.8060400000000001E-5,2.87002E-5,2.49362E-5,2.45682E-5,3.6032399999999997E-5,2.8394800000000001E-5,4.2607800000000002E-5,2.6510099999999999E-5,5.0976000000000001E-5,4.2855999999999998E-5,-5.7095500000000002E-6,6.9034699999999998E-5,5.17726E-5,4.2002100000000002E-5,1.6982699999999999E-5,2.87263E-5,1.14953E-5,2.4450199999999998E-5,7.8492400000000004E-6,2.5578299999999999E-5,1.6770999999999999E-5]
[null,null,null,425,2.3235999999999999E-5,4.2476099999999998E-5,5.4530999999999997E-5,5.3362899999999997E-5,4.7785199999999998E-5,4.33238E-5,3.4226200000000001E-5,6.4637199999999998E-5,4.9583799999999998E-5,3.5410100000000002E-5,5.9038700000000001E-5,6.7195700000000004E-5,4.1478399999999999E-5,6.8472800000000006E-5,5.9715900000000002E-5,2.64411E-5,4.2228100000000003E-5,3.95657E-5,2.13283E-5,4.9919900000000003E-5,3.1822100000000001E-5,3.50323E-5,4.1406199999999997E-5,3.24115E-5,3.2669899999999997E-5,6.0765199999999999E-5,4.6037600000000001E-5,7.4763499999999997E-5,3.47635E-5,6.9589200000000001E-5,1.7244700000000001E-5,1.95295E-5,3.4706599999999997E-5,3.2406200000000002E-5,3.4959899999999997E-5,2.1230099999999999E-5,1.67589E-5]
[null,null,null,426,2.8062999999999999E-5,4.4026100000000002E-5,2.8971799999999999E-5,2.92287E-5,5.0986799999999998E-5,5.3820100000000003E-5,2.8006099999999999E-5,5.1974400000000002E-5,4.38428E-5,2.6327899999999999E-5,3.34688E-5,5.1162699999999997E-5,2.7293499999999999E-5,3.8593000000000001E-5,2.75967E-5,9.5318000000000008E-6,1.2056699999999999E-5,2.00041E-5,4.3650199999999998E-5,4.7268000000000002E-5,1.8791300000000001E-5,2.8747399999999999E-5,1.8388899999999999E-5,4.7723699999999998E-5,2.99396E-5,4.6012900000000001E-5,7.01235E-5,6.8046900000000001E-5,3.99429E-5,3.0267899999999999E-5,3.0714299999999998E-5,4.1203299999999999E-5,3.3071699999999997E-5,5.0275000000000002E-5,4.6583599999999999E-5,3.9168999999999997E-5,9.8614500000000003E-6]
[null,null,null,427,4.9494699999999999E-5,8.3043500000000005E-5,6.9224099999999993E-5,5.9551500000000001E-5,4.8655800000000003E-5,8.0170299999999994E-5,4.9654799999999998E-5,5.3499199999999998E-5,4.2080199999999997E-5,7.0060000000000003E-5,4.2108499999999998E-5,5.4480500000000001E-5,5.0860099999999998E-5,5.4928500000000001E-5,7.7982899999999995E-5,5.8402600000000002E-5,7.4647000000000005E-5,6.4682699999999997E-5,6.3175400000000005E-5,4.8147099999999999E-5,7.7897400000000004E-5,4.70907E-5,5.0550699999999997E-5,4.3364200000000001E-5,5.8491700000000001E-5,7.10379E-5,6.1063199999999995E-5,5.5689800000000003E-5,6.7720100000000002E-5,6.1364899999999999E-5,4.1102300000000001E-5,3.5675700000000001E-5,7.2840800000000002E-5,6.5124199999999996E-5,3.0921199999999998E-5,5.2524700000000002E-5,2.1845499999999999E-5]
[null,null,null,428,-4.6269100000000004E-6,-1.8652100000000001E-5,2.4032199999999998E-6,-1.9045599999999999E-5,5.0494100000000002E-5,1.6281299999999999E-5,-7.9495000000000007E-6,1.28505E-5,-8.2787299999999996E-6,-3.0765900000000003E-5,5.8942999999999996E-6,-1.8470699999999999E-5,-2.0281100000000001E-5,-8.2176499999999992E-6,2.1393500000000001E-6,2.97862E-5,3.9454399999999998E-6,-3.4373699999999999E-5,4.76168E-6,-2.2423900000000001E-5,-6.2904799999999996E-6,2.6017200000000001E-6,-1.03305E-5,-1.1605599999999999E-5,-3.0801199999999999E-5,-3.0321799999999998E-6,4.1310799999999996E-6,-3.0839800000000002E-5,7.4976E-6,-1.38987E-5,1.25084E-5,-8.6197499999999999E-6,-3.6167000000000001E-5,-3.0494500000000001E-5,1.51661E-5,3.8157700000000004E-6,-2.73359E-5]
[null,null,null,429,3.80452E-5,3.19388E-5,5.11361E-5,3.7933499999999999E-5,3.3475100000000001E-5,3.9789500000000002E-5,3.6324800000000002E-5,2.06082E-5,1.2809999999999999E-5,3.3655200000000003E-5,2.74439E-5,3.0714799999999999E-5,2.79386E-5,4.9045899999999997E-5,3.4199899999999998E-5,2.2062400000000001E-5,5.0247100000000002E-5,3.4849499999999999E-5,2.3011699999999999E-5,2.5973699999999998E-5,4.6730100000000002E-5,2.4159400000000001E-5,5.1313899999999997E-5,2.3138299999999998E-5,1.02571E-5,5.2206900000000003E-5,-7.5726299999999997E-7,8.8193300000000008E-6,1.46744E-5,5.6126099999999998E-5,4.9561100000000002E-5,2.7653599999999999E-5,4.9066400000000002E-5,2.0375699999999999E-5,4.6137999999999998E-5,2.9139799999999998E-5,1.5795899999999999E-5]
[null,null,null,430,5.9889499999999996E-6,7.1051300000000004E-6,9.8070200000000008E-6,1.9002900000000001E-5,-1.53438E-5,1.29847E-5,-2.6476899999999998E-6,2.9649400000000001E-5,1.93457E-5,3.4373499999999998E-6,3.5078199999999998E-6,3.6887299999999999E-6,1.6510500000000001E-5,1.3382400000000001E-5,9.43393E-6,1.8938899999999999E-6,3.0110999999999999E-6,-8.4221500000000003E-6,-3.0115299999999999E-5,-2.12899E-6,2.8359600000000002E-7,-9.0000500000000003E-6,-2.4801000000000002E-6,1.24327E-5,9.0751900000000001E-6,2.9123800000000001E-5,3.0779599999999999E-5,-1.58043E-5,6.3809299999999997E-6,-6.9967500000000004E-6,1.35622E-5,5.4191599999999998E-8,9.9447400000000009E-7,4.3111500000000002E-6,-2.05045E-5,1.79017E-6,1.48128E-5]
[null,null,null,431,1.0110599999999999E-5,-3.1510399999999998E-6,-6.6762599999999997E-6,2.42391E-5,5.4034900000000002E-6,2.9793899999999999E-5,3.53414E-5,3.20005E-5,1.39729E-5,1.17365E-5,1.10495E-5,-1.9125499999999998E-5,1.4806399999999999E-5,1.9761900000000001E-5,-9.9295399999999999E-8,1.43886E-5,-1.70679E-5,-2.0523700000000001E-5,-1.66661E-5,9.4909099999999999E-6,1.7860299999999999E-5,-6.6969999999999996E-6,5.6638599999999998E-6,7.3419599999999999E-7,2.4684600000000001E-5,2.4970400000000001E-5,1.8519600000000001E-5,2.46627E-6,1.27656E-5,-7.9905000000000008E-6,-2.0734400000000001E-8,-8.8218099999999998E-6,9.7559999999999994E-6,7.9456300000000002E-7,-8.6061500000000006E-6,-5.5362100000000003E-6,5.8380499999999999E-6]
[null,null,null,432,5.6770799999999997E-6,-4.21526E-5,-4.2120499999999998E-5,-1.9850800000000001E-6,-1.30304E-5,-2.2447599999999998E-5,-2.0900599999999999E-6,-2.2067200000000001E-5,-3.9240199999999997E-5,-9.5262200000000001E-6,6.8197500000000004E-7,-1.3499700000000001E-5,-2.0111499999999998E-6,1.45695E-5,-3.0819799999999999E-5,-1.33158E-5,-6.1084699999999995E-5,-3.1473000000000002E-5,-5.6933299999999999E-5,-3.8641099999999998E-5,-2.6974700000000001E-5,-2.6597600000000001E-5,-5.8970600000000004E-6,-2.60486E-6,-2.7188000000000001E-5,-9.5008900000000003E-7,-3.9307000000000002E-5,-3.6517599999999997E-5,-1.35565E-5,-1.2355699999999999E-5,-2.7830500000000001E-5,-2.0421700000000001E-5,-4.8389300000000001E-5,-4.1941299999999998E-5,-4.2040299999999998E-5,-2.9159700000000001E-5,-4.49741E-5]
[null,null,null,433,-3.7789500000000001E-5,-2.7891600000000001E-6,3.0472600000000002E-6,-4.2979199999999997E-5,-8.0641900000000008E-6,-1.58487E-5,1.04129E-5,-1.17119E-5,1.4919099999999999E-5,1.3515000000000001E-6,2.0661599999999999E-5,-1.0752500000000001E-5,-4.9161000000000002E-6,-9.8739200000000002E-6,-1.2690100000000001E-5,-1.41846E-5,-2.27418E-5,-4.3175800000000001E-5,-9.6285799999999999E-6,-8.3188000000000007E-6,-6.8204799999999996E-6,-3.3718000000000001E-6,-2.7534200000000001E-5,-4.4979399999999998E-5,-1.8632000000000001E-5,9.7993600000000003E-6,3.0804900000000001E-6,2.47783E-5,1.26264E-5,2.9681700000000001E-5,6.0875599999999997E-6,1.8746800000000002E-5,1.0094200000000001E-5,-4.7302200000000003E-5,-4.6796399999999998E-5,-1.90736E-5,-1.11267E-7]
[null,null,null,434,8.2557199999999993E-6,-2.2633099999999998E-5,5.5331399999999998E-6,1.33734E-5,-1.0433E-5,2.17468E-6,1.2912400000000001E-6,4.3245399999999998E-5,4.0039300000000001E-5,1.4188200000000001E-5,3.0740800000000002E-5,1.5437199999999998E-5,2.1936500000000002E-6,-1.52727E-5,6.6639200000000004E-6,4.76392E-6,1.18045E-5,-4.2112200000000001E-6,-2.4633900000000001E-6,-8.8071200000000005E-6,2.8166399999999999E-5,-2.7717300000000001E-6,-4.3749500000000004E-6,3.2712199999999998E-6,1.63511E-5,1.5273399999999998E-5,8.6021599999999993E-6,2.6769100000000001E-5,1.7165900000000001E-5,1.29887E-5,-7.8321499999999992E-6,1.5357299999999999E-5,-6.4424600000000003E-6,1.225E-5,-1.72849E-6,1.23832E-5,-5.5057300000000001E-6]
[null,null,null,435,8.8794899999999999E-5,8.2328099999999995E-5,8.7890499999999995E-5,7.7477899999999999E-5,8.3038400000000001E-5,9.1770199999999998E-5,7.8941800000000004E-5,7.4399499999999998E-5,8.43577E-5,7.8324400000000005E-5,1.04345E-4,1.05945E-4,7.7758799999999998E-5,6.8233999999999998E-5,6.2712900000000001E-5,7.3945100000000005E-5,7.8541400000000007E-5,4.4227100000000002E-5,4.7763999999999999E-5,5.2576900000000001E-5,5.0404900000000003E-5,7.2280999999999995E-5,3.87162E-5,6.6526500000000001E-5,8.2429199999999993E-5,6.8227900000000005E-5,7.3003599999999993E-5,8.1479500000000005E-5,8.7322699999999997E-5,6.9681499999999993E-5,9.9781499999999993E-5,9.7134500000000003E-5,8.2646199999999995E-5,7.5384300000000003E-5,5.6813900000000002E-5,3.8534400000000002E-5,6.6536800000000003E-5]
[null,null,null,436,9.3391399999999995E-6,3.0885500000000001E-5,2.9835099999999998E-5,1.8787199999999999E-5,3.37589E-5,2.9010499999999999E-5,1.8166900000000001E-5,4.9497299999999998E-5,3.1872899999999998E-5,1.59339E-5,3.3818400000000001E-5,3.9514100000000002E-5,4.63061E-5,1.53623E-5,2.1291400000000001E-5,2.02898E-5,2.7178500000000001E-5,2.8817099999999999E-5,-7.4697699999999996E-6,-2.75878E-5,2.6998000000000001E-5,2.5215099999999999E-5,1.6239399999999999E-5,1.9051100000000001E-5,2.6074199999999998E-5,3.2001300000000001E-5,3.01589E-5,4.03478E-5,1.2065900000000001E-5,3.6350000000000003E-5,4.31941E-5,3.0071799999999999E-5,6.4347899999999994E-5,2.6658000000000001E-5,1.8434300000000001E-5,-2.51139E-5,2.9998200000000002E-7]
[null,null,null,437,2.5922600000000001E-5,1.31898E-5,4.9695199999999998E-5,4.4453200000000003E-5,2.8349900000000001E-5,6.1332000000000002E-5,3.9431100000000003E-5,6.2212399999999994E-5,6.2682399999999995E-5,4.6470200000000001E-5,4.4020699999999997E-5,5.7490300000000001E-5,5.6144199999999997E-5,3.15524E-5,4.0034499999999998E-5,6.8301900000000004E-5,2.3460900000000001E-5,1.33334E-5,9.3622899999999994E-6,2.5602899999999998E-5,4.1158000000000001E-5,4.5397600000000001E-5,4.3245299999999997E-5,3.3702699999999998E-5,4.2098400000000003E-5,6.7030899999999995E-5,6.2414899999999998E-5,3.3011800000000001E-5,5.5049900000000003E-5,5.8177300000000003E-5,6.8309100000000006E-5,3.9925600000000003E-5,6.5446500000000004E-5,3.6229500000000003E-5,3.1482100000000001E-5,1.04013E-5,1.38919E-5]
[null,null,null,438,7.0834500000000001E-5,7.0973800000000001E-5,6.5787500000000007E-5,9.0211300000000001E-5,9.1285699999999999E-5,9.9872799999999997E-5,5.0243600000000001E-5,8.8027699999999997E-5,8.2966099999999998E-5,9.1262399999999995E-5,5.3832000000000002E-5,8.4017299999999999E-5,1.19601E-4,5.6407099999999997E-5,8.3447899999999998E-5,6.9488399999999997E-5,6.6533999999999997E-5,6.4572699999999999E-5,7.3502000000000002E-5,5.7086899999999997E-5,5.9602199999999997E-5,5.53761E-5,6.9513399999999998E-5,9.1749799999999994E-5,7.6269500000000006E-5,6.0296600000000001E-5,7.7065300000000002E-5,9.1191600000000003E-5,7.5216999999999995E-5,9.6335099999999999E-5,5.9462900000000003E-5,5.5368799999999997E-5,1.0708E-4,5.18964E-5,5.6898299999999997E-5,7.3610700000000003E-5,4.9513099999999999E-5]
[null,null,null,439,4.7302699999999997E-5,4.17878E-5,1.50769E-5,5.3586399999999999E-5,4.3306799999999997E-5,8.8811899999999996E-5,6.5990399999999998E-5,8.91969E-5,1.03807E-4,1.00435E-4,5.5411400000000003E-5,7.5787900000000007E-5,6.1524699999999997E-5,6.1299599999999998E-5,7.1261999999999996E-5,9.4629000000000005E-5,3.9138799999999999E-5,5.8483400000000003E-5,5.0006899999999997E-5,8.5459599999999997E-5,9.0530100000000003E-6,6.7785099999999996E-5,6.8200400000000005E-5,7.0312299999999994E-5,8.8024799999999998E-5,8.4309199999999996E-5,6.6562400000000005E-5,7.8410499999999997E-5,5.3323799999999999E-5,1.1820999999999999E-4,8.5429300000000006E-5,8.8311699999999997E-5,8.93668E-5,6.5236500000000005E-5,4.42477E-5,8.8351900000000004E-5,5.8033399999999999E-5]
[null,null,null,440,6.8880600000000006E-5,6.4418900000000001E-5,4.9981700000000003E-5,9.4594300000000003E-5,1.04047E-4,9.3172999999999997E-5,8.5966300000000004E-5,9.5746499999999995E-5,1.0353699999999999E-4,8.9378900000000006E-5,7.9364300000000002E-5,1.11226E-4,1.15526E-4,1.02669E-4,7.7916200000000005E-5,8.0753400000000005E-5,5.6092399999999998E-5,7.8483800000000002E-5,8.8542300000000001E-5,6.2026599999999993E-5,6.6542600000000002E-5,7.3962900000000003E-5,6.1408400000000007E-5,8.4380800000000004E-5,6.5448400000000002E-5,1.19664E-4,9.4996500000000004E-5,9.4550399999999995E-5,8.8904099999999995E-5,1.09718E-4,1.0275199999999999E-4,1.1961899999999999E-4,8.3752199999999994E-5,1.06285E-4,8.2949100000000002E-5,8.2625699999999997E-5,5.2111599999999998E-5]
[null,null,null,441,4.2156900000000003E-5,6.3353000000000001E-5,6.3858700000000006E-5,7.3160700000000006E-5,7.8030100000000004E-5,8.1230000000000007E-5,9.5946900000000001E-5,1.01322E-4,8.4671099999999996E-5,9.3082699999999996E-5,9.8203300000000002E-5,1.0508E-4,8.2563000000000002E-5,7.5989100000000001E-5,9.6053799999999998E-5,6.7415899999999999E-5,5.84015E-5,6.7685299999999994E-5,4.4715999999999997E-5,3.2989199999999999E-5,6.2701500000000003E-5,4.92695E-5,7.1491199999999997E-5,9.3332999999999996E-5,8.3094299999999995E-5,1.03699E-4,9.3973000000000003E-5,9.2322499999999996E-5,8.7916499999999998E-5,7.8806099999999998E-5,1.17501E-4,9.6787399999999994E-5,6.7892500000000001E-5,9.1918799999999998E-5,5.31077E-5,5.6375500000000003E-5,2.3451800000000001E-5]
[null,null,null,442,9.8418600000000003E-6,6.6161999999999994E-5,5.9679999999999998E-5,6.3239100000000002E-5,5.7720599999999998E-5,5.4391300000000002E-5,7.4724100000000005E-5,8.4111199999999995E-5,8.09982E-5,7.90388E-5,9.50379E-5,8.2566599999999997E-5,5.7571500000000003E-5,6.6056700000000001E-5,7.9312299999999996E-5,5.5374699999999997E-5,5.0952799999999998E-5,2.8056699999999999E-5,1.1123499999999999E-5,8.3257099999999996E-6,3.0073099999999998E-5,2.4547999999999999E-5,5.3711400000000002E-5,1.01838E-4,6.7738999999999996E-5,9.0857099999999994E-5,7.8057299999999995E-5,9.4337299999999995E-5,9.01642E-5,7.0675999999999999E-5,7.8847100000000006E-5,6.9240799999999996E-5,5.5269400000000003E-5,6.2538600000000005E-5,5.3428599999999999E-5,3.5570700000000001E-5,4.3195699999999997E-5]
[null,null,null,443,8.9981800000000006E-5,1.04533E-4,9.7966299999999997E-5,1.3039099999999999E-4,1.3977600000000001E-4,1.44547E-4,1.4379E-4,1.48178E-4,1.63917E-4,1.3795600000000001E-4,1.57534E-4,1.4627800000000001E-4,1.5617100000000001E-4,1.5570499999999999E-4,1.38374E-4,1.37043E-4,1.11183E-4,9.18051E-5,1.10412E-4,6.2470899999999998E-5,1.2809799999999999E-4,9.4473099999999995E-5,1.4791199999999999E-4,1.3914900000000001E-4,1.18106E-4,1.47155E-4,1.5371499999999999E-4,1.28026E-4,1.44291E-4,1.6521999999999999E-4,1.2771599999999999E-4,1.37465E-4,1.3287800000000001E-4,1.3197E-4,9.3318800000000005E-5,1.00089E-4,1.0108299999999999E-4]
[null,null,null,444,3.9028E-5,5.8901099999999998E-5,5.2073400000000002E-5,8.9001399999999998E-5,7.4144E-5,6.1937699999999995E-5,1.0394E-4,7.4680199999999997E-5,1.01455E-4,7.4107699999999995E-5,1.00665E-4,9.5157799999999999E-5,6.00118E-5,9.5230399999999995E-5,4.2095300000000003E-5,5.4272199999999999E-5,3.9600500000000001E-5,5.1921900000000002E-5,2.85068E-5,3.8977899999999998E-5,1.22246E-5,5.0562899999999997E-5,6.6012299999999998E-5,4.6878800000000003E-5,8.0590600000000001E-5,6.1665499999999994E-5,9.5306699999999993E-5,7.1460300000000004E-5,1.02657E-4,8.6231399999999996E-5,1.09621E-4,5.3894200000000003E-5,2.3920399999999999E-5,4.5669900000000001E-5,3.4049900000000001E-5,2.3935999999999999E-5,1.6928699999999999E-5]
[null,null,null,445,5.9984400000000001E-5,1.01981E-4,8.3069200000000001E-5,1.4051600000000001E-4,1.2602499999999999E-4,1.1336399999999999E-4,1.3349E-4,1.27553E-4,1.55515E-4,1.3954200000000001E-4,1.6129999999999999E-4,1.5362000000000001E-4,1.36427E-4,1.3870000000000001E-4,1.15458E-4,9.4693799999999998E-5,9.1335000000000006E-5,1.3165200000000001E-4,7.4661399999999996E-5,6.0086700000000002E-5,7.8387500000000001E-5,1.1965599999999999E-4,9.0020700000000004E-5,9.8839300000000001E-5,1.50366E-4,1.33549E-4,1.4384399999999999E-4,1.4848199999999999E-4,1.62819E-4,1.4573200000000001E-4,1.5720299999999999E-4,1.48732E-4,1.4694799999999999E-4,1.04305E-4,1.19145E-4,7.1870000000000001E-5,8.3703300000000002E-5]
[null,null,null,446,8.4825899999999997E-5,1.08436E-4,1.21383E-4,1.2279899999999999E-4,1.5580600000000001E-4,1.66081E-4,1.6366199999999999E-4,1.7006200000000001E-4,1.62294E-4,1.8935100000000001E-4,1.8424899999999999E-4,1.6075099999999999E-4,1.41562E-4,1.81361E-4,1.4392300000000001E-4,1.2837600000000001E-4,1.3160299999999999E-4,1.4302100000000001E-4,9.2405399999999995E-5,7.8969700000000004E-5,9.4295699999999999E-5,1.21328E-4,1.4689299999999999E-4,1.3258200000000001E-4,1.5676000000000001E-4,1.7645599999999999E-4,1.7698799999999999E-4,2.15527E-4,1.57307E-4,1.7075200000000001E-4,1.8046499999999999E-4,1.90621E-4,1.37207E-4,1.3306799999999999E-4,1.3932199999999999E-4,9.3557199999999999E-5,1.05531E-4]
[null,null,null,447,1.03291E-4,1.17614E-4,1.10522E-4,1.18967E-4,1.37699E-4,1.64284E-4,1.6368900000000001E-4,1.68312E-4,1.6793099999999999E-4,1.73485E-4,1.72762E-4,1.6999199999999999E-4,1.73492E-4,1.6712699999999999E-4,1.48052E-4,1.18558E-4,1.2574400000000001E-4,1.13718E-4,1.0329500000000001E-4,7.6056099999999998E-5,1.16774E-4,1.02049E-4,1.40822E-4,1.2255299999999999E-4,1.59142E-4,2.04114E-4,1.68293E-4,1.7351700000000001E-4,1.7364100000000001E-4,1.97484E-4,1.8525799999999999E-4,1.9299000000000001E-4,1.68252E-4,1.2132400000000001E-4,1.2774999999999999E-4,1.01561E-4,9.14219E-5]
[null,null,null,448,1.13127E-4,1.5004300000000001E-4,1.5411900000000001E-4,1.54217E-4,1.5583599999999999E-4,2.0667600000000001E-4,2.2094000000000001E-4,2.0576700000000001E-4,2.23942E-4,2.0543699999999999E-4,2.16837E-4,2.0163700000000001E-4,2.1554899999999999E-4,2.0183000000000001E-4,1.8829E-4,1.4607300000000001E-4,1.32476E-4,1.2840099999999999E-4,1.5474600000000001E-4,1.09256E-4,1.5655000000000001E-4,1.3095500000000001E-4,1.8423199999999999E-4,1.4390900000000001E-4,2.02043E-4,2.41566E-4,2.15751E-4,2.1166199999999999E-4,2.3057700000000001E-4,2.53195E-4,2.1569699999999999E-4,2.3708099999999999E-4,1.8993600000000001E-4,1.73358E-4,1.6783100000000001E-4,1.3921800000000001E-4,1.41333E-4]
[null,null,null,449,1.56212E-4,1.5082E-4,1.6301299999999999E-4,2.17202E-4,2.0812399999999999E-4,2.1555700000000001E-4,2.2992999999999999E-4,2.25274E-4,2.4781299999999999E-4,2.4004000000000001E-4,2.58304E-4,2.2745600000000001E-4,2.0083300000000001E-4,2.2202100000000001E-4,2.25591E-4,1.90435E-4,1.54136E-4,1.4932500000000001E-4,1.1527399999999999E-4,1.1550800000000001E-4,1.45384E-4,1.68028E-4,2.2382500000000001E-4,2.0155800000000001E-4,2.2016000000000001E-4,2.6597099999999999E-4,2.4073599999999999E-4,2.1939999999999999E-4,2.5985899999999998E-4,2.3700699999999999E-4,2.18008E-4,2.1924499999999999E-4,2.1621499999999999E-4,2.0914999999999999E-4,1.53876E-4,1.9164799999999999E-4,1.4282800000000001E-4]
[null,null,null,450,1.58183E-4,1.65384E-4,2.12621E-4,2.33081E-4,2.4339199999999999E-4,2.4564900000000002E-4,2.71356E-4,2.8934300000000001E-4,2.82704E-4,2.7284400000000001E-4,2.7355100000000002E-4,2.59485E-4,2.6244899999999999E-4,2.5982000000000002E-4,2.4621400000000002E-4,2.1356399999999999E-4,2.1466899999999999E-4,1.7202999999999999E-4,1.5354600000000001E-4,1.55358E-4,1.62206E-4,2.1259100000000001E-4,2.1371300000000001E-4,2.1564199999999999E-4,2.1294400000000001E-4,2.4450999999999997E-4,2.9105E-4,2.6577799999999999E-4,2.6518000000000001E-4,2.7158400000000001E-4,2.5753899999999999E-4,2.3868500000000001E-4,2.6807799999999999E-4,2.2554399999999999E-4,1.8947500000000001E-4,1.89471E-4,1.3967499999999999E-4]
[null,null,null,451,1.60054E-4,1.8263399999999999E-4,2.3321099999999999E-4,2.3539399999999999E-4,2.6586999999999997E-4,2.8996000000000002E-4,3.1091099999999998E-4,3.2390499999999998E-4,2.8656200000000003E-4,3.3818100000000001E-4,3.1724999999999999E-4,3.0765300000000002E-4,2.9488000000000002E-4,2.68416E-4,2.7126400000000001E-4,2.4306499999999999E-4,2.2939600000000001E-4,2.25069E-4,1.7681700000000001E-4,1.4563799999999999E-4,2.0645400000000001E-4,2.1840100000000001E-4,2.6908500000000002E-4,2.6112500000000002E-4,2.7538299999999998E-4,2.8450600000000002E-4,2.8640799999999999E-4,3.0412000000000001E-4,3.1207400000000002E-4,2.9736900000000002E-4,2.7809299999999998E-4,3.08182E-4,2.9482E-4,2.4785200000000001E-4,2.1449899999999999E-4,1.9737199999999999E-4,1.62471E-4]
[null,null,null,452,1.8806000000000001E-4,2.14269E-4,2.6241300000000002E-4,2.7639500000000003E-4,3.0305300000000001E-4,3.3178199999999998E-4,3.42319E-4,3.8931700000000003E-4,3.5908100000000003E-4,3.75347E-4,3.5567500000000001E-4,3.6496599999999999E-4,3.2744700000000002E-4,3.2604999999999998E-4,2.9932800000000002E-4,2.9199299999999999E-4,2.7105800000000002E-4,2.4016700000000001E-4,2.0928400000000001E-4,1.8084000000000001E-4,2.30368E-4,2.4907999999999999E-4,2.93009E-4,3.2755799999999998E-4,3.2560800000000002E-4,3.35481E-4,3.3699799999999997E-4,3.5054800000000001E-4,3.8534600000000001E-4,3.3403699999999997E-4,3.6569199999999998E-4,3.2367700000000003E-4,3.2584500000000001E-4,2.6296400000000003E-4,2.6937599999999999E-4,2.3893800000000001E-4,2.2089599999999999E-4]
[null,null,null,453,2.3931700000000001E-4,2.4685799999999997E-4,3.0147600000000001E-4,3.0947499999999997E-4,3.6631700000000001E-4,4.0918500000000001E-4,4.25604E-4,4.41669E-4,4.2353200000000001E-4,4.3255499999999999E-4,4.1534599999999998E-4,4.0680300000000001E-4,3.9270400000000001E-4,4.0912700000000001E-4,3.6282699999999997E-4,3.5138299999999998E-4,3.27752E-4,2.9797500000000002E-4,2.8306799999999998E-4,2.38984E-4,2.9842900000000001E-4,3.1513100000000002E-4,3.2604800000000001E-4,3.78119E-4,3.61947E-4,4.0849700000000002E-4,3.8609199999999999E-4,4.21631E-4,4.3826599999999998E-4,4.3129799999999999E-4,4.23786E-4,3.8819000000000001E-4,3.6815300000000002E-4,3.5156100000000002E-4,3.2295000000000002E-4,3.02708E-4,2.56541E-4]
[null,null,null,454,2.4693499999999999E-4,2.6516899999999999E-4,2.9245600000000002E-4,3.5425300000000001E-4,3.5868899999999998E-4,3.83834E-4,4.4426300000000003E-4,4.4886999999999998E-4,4.5152700000000002E-4,4.61552E-4,4.2794900000000001E-4,4.2559E-4,4.25046E-4,4.1779099999999998E-4,4.08589E-4,3.3521700000000001E-4,3.1255399999999999E-4,2.73832E-4,2.3608599999999999E-4,2.6628399999999999E-4,2.94383E-4,3.0215299999999999E-4,3.3691E-4,3.76332E-4,3.8757700000000001E-4,4.3629600000000003E-4,4.6538200000000002E-4,4.4378899999999999E-4,4.3326500000000001E-4,4.7307000000000002E-4,4.4051600000000001E-4,4.15609E-4,3.7711299999999999E-4,3.5205399999999997E-4,3.1288699999999997E-4,2.9955500000000001E-4,2.6291999999999998E-4]
[null,null,null,455,2.2106799999999999E-4,2.5989399999999999E-4,3.25545E-4,4.0567899999999999E-4,4.4198600000000001E-4,4.0033799999999997E-4,4.75957E-4,4.5218500000000002E-4,4.51285E-4,4.75654E-4,4.8013E-4,4.5615400000000001E-4,4.3727000000000002E-4,4.2412899999999998E-4,3.7126200000000002E-4,4.0118100000000002E-4,3.4252000000000002E-4,2.5894999999999998E-4,2.4365899999999999E-4,2.9667400000000003E-4,2.6789899999999999E-4,3.2699600000000002E-4,3.9283200000000002E-4,3.8381899999999998E-4,4.0421700000000001E-4,4.7851399999999998E-4,4.4103399999999998E-4,4.6420599999999999E-4,4.6623200000000002E-4,4.74325E-4,4.3635700000000001E-4,4.23466E-4,4.0956899999999998E-4,3.29198E-4,3.4450600000000001E-4,2.9113099999999997E-4,2.25219E-4]
[null,null,null,456,2.8289599999999998E-4,3.2035700000000001E-4,3.4883400000000001E-4,4.0659399999999998E-4,4.4726100000000001E-4,4.46558E-4,4.8833700000000004E-4,4.9031499999999996E-4,5.0851800000000001E-4,5.1230500000000001E-4,5.3170699999999997E-4,4.9293199999999996E-4,4.6771600000000002E-4,4.6028699999999998E-4,4.25408E-4,4.2223400000000001E-4,3.4905E-4,3.1065299999999998E-4,2.7322400000000003E-4,2.6484399999999997E-4,3.0341199999999997E-4,3.6382800000000001E-4,4.1038400000000002E-4,4.1685600000000001E-4,4.73702E-4,4.6961000000000003E-4,4.9155200000000003E-4,5.3874000000000001E-4,5.0652E-4,5.0891900000000004E-4,5.0084499999999998E-4,4.7587399999999999E-4,4.6553700000000003E-4,3.8817700000000002E-4,3.5922100000000001E-4,3.0065499999999999E-4,2.6412799999999998E-4]
[null,null,null,457,3.1716399999999999E-4,3.6035800000000002E-4,4.3488000000000001E-4,4.57675E-4,5.1566000000000003E-4,5.4074600000000004E-4,5.65987E-4,5.8878299999999995E-4,5.8566900000000003E-4,5.8917099999999999E-4,6.1002599999999995E-4,5.93455E-4,5.5836099999999995E-4,5.7365300000000003E-4,5.1100799999999997E-4,4.6643599999999998E-4,4.3115599999999998E-4,3.4906899999999997E-4,3.2818399999999997E-4,3.0688999999999998E-4,3.5380900000000001E-4,4.33137E-4,4.7630200000000001E-4,5.0481799999999998E-4,5.3642000000000002E-4,5.5659999999999998E-4,5.7605999999999998E-4,5.9970399999999995E-4,5.8642299999999998E-4,5.8810000000000004E-4,5.8591700000000004E-4,5.4273400000000001E-4,5.0243100000000001E-4,4.73974E-4,4.28854E-4,3.5113100000000002E-4,3.3196499999999998E-4]
[null,null,null,458,3.1188500000000003E-4,3.6953799999999998E-4,4.2968699999999999E-4,4.5679500000000002E-4,5.1500899999999997E-4,5.6594100000000004E-4,5.6184799999999999E-4,5.9002499999999999E-4,6.0183000000000003E-4,6.2760500000000005E-4,6.0338199999999996E-4,5.8948099999999999E-4,5.6993899999999999E-4,5.7516800000000003E-4,5.0329200000000002E-4,4.7279599999999999E-4,4.35189E-4,3.70761E-4,3.1854300000000002E-4,2.9329399999999999E-4,3.78656E-4,3.9575500000000002E-4,4.6400499999999997E-4,5.0887800000000004E-4,5.3588699999999997E-4,5.6897399999999998E-4,5.9844599999999998E-4,6.0439399999999996E-4,6.2952199999999998E-4,6.1286000000000001E-4,5.8278900000000001E-4,5.2842999999999998E-4,5.0515800000000002E-4,4.6624600000000002E-4,4.1252599999999997E-4,3.5189500000000002E-4,3.3373399999999997E-4]
[null,null,null,459,3.6657600000000002E-4,4.3626100000000002E-4,4.7320899999999999E-4,5.0931399999999997E-4,5.5629799999999999E-4,6.3811300000000005E-4,6.4763400000000001E-4,6.46635E-4,6.8776999999999998E-4,6.6145199999999998E-4,6.9039100000000005E-4,6.9007300000000003E-4,6.8582799999999998E-4,6.3947699999999995E-4,5.6793000000000002E-4,5.5876899999999998E-4,4.7616800000000001E-4,4.2942499999999999E-4,3.89956E-4,3.8000499999999999E-4,4.33464E-4,4.7395199999999998E-4,5.25801E-4,5.82754E-4,6.0333399999999997E-4,6.0975899999999997E-4,6.5532999999999998E-4,7.0279000000000001E-4,7.0934299999999997E-4,6.85912E-4,6.5666499999999996E-4,6.3987400000000002E-4,6.04548E-4,5.6263400000000001E-4,4.6527299999999999E-4,4.3996500000000001E-4,3.8609799999999998E-4]
[null,null,null,460,3.6545700000000002E-4,4.1144499999999997E-4,5.0810899999999997E-4,5.2981000000000002E-4,6.0187299999999995E-4,6.4934200000000002E-4,6.6178500000000002E-4,6.8486999999999997E-4,6.9350100000000001E-4,6.9472000000000002E-4,7.0457799999999998E-4,6.9317999999999995E-4,6.97205E-4,6.3534300000000002E-4,5.8693600000000003E-4,5.8681100000000002E-4,5.0648100000000003E-4,4.2069299999999998E-4,3.7125299999999999E-4,3.8874899999999997E-4,4.1229199999999998E-4,4.8878799999999998E-4,5.2890299999999995E-4,6.1954200000000005E-4,6.0940699999999996E-4,6.3865999999999999E-4,6.5289700000000005E-4,7.0977900000000001E-4,6.9882099999999997E-4,7.0357700000000004E-4,6.9617500000000005E-4,6.3969099999999996E-4,6.1491300000000003E-4,5.4383800000000005E-4,5.0121499999999995E-4,4.21259E-4,3.8660799999999998E-4]
[null,null,null,461,3.59854E-4,4.2145300000000002E-4,4.7316399999999998E-4,5.2276999999999998E-4,5.7706100000000002E-4,6.2981599999999995E-4,6.5758600000000004E-4,7.0628900000000003E-4,7.1327599999999999E-4,7.0654699999999997E-4,7.0765200000000002E-4,7.0061799999999997E-4,6.9039000000000004E-4,5.9786699999999997E-4,6.2354200000000004E-4,5.8002599999999998E-4,4.5709899999999998E-4,4.0146000000000002E-4,3.9478799999999997E-4,3.1775199999999998E-4,4.24592E-4,4.7506300000000002E-4,5.4911599999999999E-4,5.73527E-4,6.2879799999999997E-4,6.8399400000000005E-4,6.4663000000000003E-4,7.0780099999999998E-4,7.1647400000000004E-4,6.9224800000000002E-4,6.8481399999999995E-4,6.4491099999999997E-4,6.0123700000000002E-4,5.4386699999999996E-4,4.7861799999999999E-4,4.2056599999999998E-4,3.4950999999999998E-4]
[null,null,null,462,4.0847000000000002E-4,4.5515399999999999E-4,5.2267199999999996E-4,5.5013600000000001E-4,6.3034600000000005E-4,6.9892900000000004E-4,7.1394700000000004E-4,7.2856799999999997E-4,7.4512899999999997E-4,7.5595100000000004E-4,7.3010299999999996E-4,7.4262700000000004E-4,7.0384799999999997E-4,6.8204400000000003E-4,6.39074E-4,5.8665699999999998E-4,5.1161200000000005E-4,4.6129199999999997E-4,3.9392700000000002E-4,3.8746400000000002E-4,4.5442300000000002E-4,4.9642899999999995E-4,6.0070499999999999E-4,6.2138099999999995E-4,6.5013600000000005E-4,6.7598300000000001E-4,7.5885899999999997E-4,7.1685800000000001E-4,7.4674300000000002E-4,7.6758299999999996E-4,7.2178599999999998E-4,6.9448199999999996E-4,6.5353199999999996E-4,5.8326099999999996E-4,5.2615300000000002E-4,4.4320200000000002E-4,3.9594499999999998E-4]
[null,null,null,463,4.07997E-4,4.5847800000000001E-4,5.4568499999999996E-4,5.8626800000000003E-4,6.3395400000000005E-4,6.9753199999999995E-4,7.3168400000000002E-4,7.5454799999999996E-4,7.5493999999999995E-4,7.77508E-4,7.4511399999999995E-4,7.4423700000000002E-4,7.4397000000000005E-4,7.0428600000000004E-4,6.4403599999999996E-4,5.9663700000000001E-4,5.37032E-4,4.79321E-4,4.22664E-4,4.1108099999999999E-4,4.9793799999999996E-4,5.28948E-4,6.18478E-4,6.3650899999999995E-4,6.7758100000000002E-4,7.1483799999999998E-4,7.6155299999999999E-4,7.4327300000000002E-4,7.7186699999999997E-4,7.78059E-4,7.3821900000000003E-4,7.1816399999999998E-4,6.6768399999999999E-4,6.1468199999999997E-4,5.5297699999999996E-4,4.55589E-4,4.0508999999999999E-4]
[null,null,null,464,3.94597E-4,4.3513299999999998E-4,5.3389799999999999E-4,6.0634700000000003E-4,6.2706399999999999E-4,7.0556600000000003E-4,7.3410100000000002E-4,7.5986499999999998E-4,7.7003300000000005E-4,7.6691599999999997E-4,7.6103900000000003E-4,7.4126900000000002E-4,7.6809899999999995E-4,7.2208500000000002E-4,6.6797099999999995E-4,6.2295000000000004E-4,5.4035200000000002E-4,4.7420300000000003E-4,4.31044E-4,4.1041500000000002E-4,4.8767199999999998E-4,5.3634699999999995E-4,6.00396E-4,6.5251299999999996E-4,6.94664E-4,7.3410100000000002E-4,7.41254E-4,7.5726099999999996E-4,7.9077100000000001E-4,7.7267299999999998E-4,7.3405300000000003E-4,7.1077300000000005E-4,6.4859399999999995E-4,6.3607699999999997E-4,5.4916100000000005E-4,4.6930799999999999E-4,3.9891699999999999E-4]
[null,null,null,465,4.26E-4,4.4254899999999998E-4,5.7176899999999997E-4,6.1000900000000001E-4,6.6349699999999998E-4,6.8499200000000004E-4,7.2009899999999998E-4,7.6128100000000005E-4,7.7295100000000002E-4,7.7260199999999995E-4,7.6776000000000004E-4,7.99915E-4,7.6021300000000003E-4,7.1268799999999995E-4,6.3441400000000003E-4,6.1883200000000004E-4,5.1561499999999998E-4,4.8921800000000003E-4,4.15451E-4,4.27646E-4,4.84754E-4,5.0446200000000001E-4,6.0608099999999996E-4,6.3632300000000005E-4,6.8464600000000002E-4,7.0877799999999997E-4,7.4318699999999997E-4,7.4197800000000002E-4,7.5837699999999997E-4,7.7516800000000002E-4,7.44972E-4,7.0845900000000004E-4,6.2743300000000005E-4,6.0044000000000004E-4,4.9737200000000005E-4,4.8713100000000002E-4,3.9762800000000002E-4]
[null,null,null,466,3.6419700000000002E-4,4.0308800000000001E-4,4.9203699999999996E-4,5.6177699999999996E-4,5.8970400000000003E-4,6.3111500000000002E-4,7.0776699999999999E-4,6.75459E-4,7.2808300000000003E-4,7.4462900000000002E-4,6.9987399999999996E-4,7.1681800000000003E-4,7.1135000000000002E-4,6.6248900000000005E-4,6.2498899999999995E-4,5.3873199999999999E-4,4.7666400000000002E-4,4.4262899999999999E-4,3.79327E-4,3.4762500000000001E-4,4.6607700000000002E-4,4.8525899999999998E-4,5.7307600000000005E-4,6.1777499999999999E-4,6.4102300000000001E-4,6.8142500000000004E-4,6.8459399999999996E-4,7.2218900000000003E-4,7.3192999999999999E-4,7.4374E-4,6.9508700000000005E-4,6.6449100000000002E-4,6.3364599999999997E-4,5.7950899999999997E-4,5.0508200000000001E-4,4.4426600000000002E-4,3.8757400000000001E-4]
[null,null,null,467,4.2887399999999999E-4,4.80984E-4,5.0989999999999998E-4,6.0258399999999998E-4,6.5671900000000005E-4,7.0106400000000005E-4,7.1381000000000005E-4,7.7370599999999998E-4,7.8088500000000004E-4,7.6987799999999999E-4,7.8116800000000005E-4,7.5589400000000001E-4,7.3145899999999995E-4,7.24342E-4,6.8006900000000005E-4,5.9434500000000003E-4,5.4146700000000001E-4,4.9832299999999995E-4,4.0930600000000001E-4,4.1899500000000002E-4,4.7849999999999998E-4,5.5679000000000004E-4,6.0804900000000005E-4,6.3657299999999998E-4,6.8198200000000003E-4,7.58792E-4,7.3807699999999996E-4,7.6372400000000002E-4,7.7742200000000005E-4,7.7691200000000005E-4,7.3535199999999999E-4,7.1002100000000002E-4,6.6882699999999998E-4,6.0068299999999997E-4,5.38843E-4,4.78085E-4,4.2417900000000001E-4]
[null,null,null,468,4.3488899999999999E-4,4.7357299999999997E-4,5.3930099999999995E-4,6.0950299999999995E-4,6.6066699999999998E-4,6.9888700000000003E-4,7.4342099999999997E-4,7.4776699999999998E-4,7.9258300000000002E-4,7.7261099999999998E-4,7.7263899999999999E-4,7.4274300000000003E-4,7.4308999999999996E-4,6.9865900000000002E-4,6.9476100000000001E-4,6.1139300000000001E-4,5.5487899999999998E-4,4.8662199999999998E-4,4.2004599999999998E-4,4.2786300000000001E-4,4.9174400000000001E-4,5.6836300000000001E-4,5.95603E-4,6.7020800000000005E-4,7.0889900000000003E-4,7.3678199999999995E-4,7.4603699999999996E-4,7.4734499999999995E-4,7.8110699999999996E-4,7.7450900000000005E-4,7.4018100000000002E-4,7.3444099999999996E-4,6.5177300000000002E-4,6.24221E-4,5.4231500000000003E-4,4.8626099999999998E-4,4.1464900000000001E-4]
[null,null,null,469,4.1059000000000001E-4,4.2949200000000001E-4,5.2647800000000004E-4,6.0000199999999998E-4,6.1249999999999998E-4,6.9519199999999997E-4,7.1819099999999997E-4,7.1971000000000003E-4,7.4189199999999996E-4,7.4542E-4,7.5593800000000005E-4,7.2608099999999995E-4,7.0594600000000005E-4,6.8324900000000003E-4,6.7222199999999999E-4,6.0019499999999998E-4,5.2764800000000003E-4,4.4355099999999998E-4,4.1514699999999999E-4,4.1500199999999998E-4,4.8113000000000002E-4,5.0336599999999999E-4,5.9387199999999995E-4,6.3192900000000004E-4,6.8866700000000001E-4,7.2356999999999999E-4,7.1894299999999999E-4,7.1979499999999996E-4,7.4022900000000002E-4,7.7352599999999997E-4,7.3923999999999995E-4,7.1027099999999995E-4,6.2595000000000001E-4,5.86025E-4,5.3972600000000003E-4,4.7130499999999999E-4,3.9905000000000002E-4]
[null,null,null,470,3.6185699999999999E-4,4.6777E-4,4.8509300000000003E-4,5.6490499999999999E-4,5.8964E-4,6.6351599999999995E-4,6.8581999999999996E-4,7.0299399999999997E-4,7.0755500000000001E-4,7.2628500000000002E-4,7.2096499999999995E-4,7.32192E-4,6.8056699999999998E-4,6.5864099999999996E-4,6.3535000000000002E-4,5.7406600000000003E-4,5.0361999999999998E-4,4.4893800000000002E-4,3.6410899999999999E-4,3.7877700000000001E-4,4.4156399999999998E-4,4.8475800000000001E-4,5.7328000000000001E-4,6.0292199999999998E-4,6.5135900000000001E-4,6.9399800000000003E-4,7.1863199999999997E-4,6.9537199999999998E-4,7.1831100000000001E-4,7.2720599999999999E-4,7.3006199999999996E-4,6.7341099999999995E-4,6.1153499999999996E-4,5.8422200000000002E-4,5.2079000000000003E-4,4.4107700000000001E-4,3.6724099999999998E-4]
[null,null,null,471,3.1430800000000001E-4,4.1751400000000001E-4,4.6975499999999998E-4,5.4233099999999995E-4,5.49867E-4,6.0862299999999998E-4,6.3886399999999995E-4,6.4972100000000002E-4,6.5232799999999998E-4,6.5024600000000005E-4,6.7662199999999999E-4,6.4772199999999999E-4,6.3811599999999999E-4,6.1991200000000002E-4,5.8068099999999999E-4,5.4191899999999997E-4,4.6553099999999999E-4,4.2187700000000003E-4,3.6230499999999999E-4,3.1675799999999999E-4,3.9221299999999998E-4,4.5823499999999998E-4,4.9859600000000002E-4,5.5445400000000001E-4,6.1600200000000004E-4,6.4357300000000004E-4,6.6589800000000005E-4,6.7317400000000002E-4,6.7983200000000001E-4,6.7195099999999995E-4,6.3299099999999996E-4,6.2782699999999996E-4,5.76254E-4,5.4633500000000001E-4,4.90965E-4,3.9618900000000002E-4,3.38308E-4]
[null,null,null,472,3.9142799999999998E-4,4.59603E-4,5.1745299999999997E-4,5.7271299999999998E-4,6.2695399999999999E-4,6.5396200000000001E-4,6.6931300000000005E-4,6.9544599999999995E-4,7.5101699999999998E-4,7.2476799999999998E-4,7.3931599999999995E-4,7.0852399999999998E-4,6.9538300000000005E-4,6.7374999999999998E-4,6.2081199999999999E-4,5.7652500000000004E-4,4.9526300000000002E-4,4.4433400000000001E-4,3.9007499999999998E-4,3.7516600000000002E-4,4.42185E-4,5.2332500000000005E-4,5.8494999999999999E-4,5.8968200000000001E-4,6.5047200000000003E-4,6.6851900000000001E-4,7.09544E-4,7.1474199999999998E-4,7.2948299999999995E-4,7.3248200000000001E-4,7.0514000000000004E-4,6.4787700000000004E-4,6.4323099999999997E-4,5.8103600000000005E-4,5.0491100000000003E-4,4.3044900000000001E-4,3.8729900000000002E-4]
[null,null,null,473,3.7493299999999998E-4,4.3470899999999997E-4,5.0628399999999997E-4,5.5196399999999995E-4,5.8784199999999999E-4,6.4712999999999999E-4,6.7767399999999996E-4,7.0784500000000002E-4,7.0258500000000004E-4,7.02796E-4,6.91379E-4,7.0169700000000004E-4,6.7106200000000005E-4,6.6825999999999995E-4,5.9442299999999996E-4,5.4923799999999996E-4,4.8964099999999997E-4,4.2743300000000001E-4,3.7970799999999998E-4,3.6601800000000002E-4,4.2602500000000001E-4,5.0058000000000004E-4,5.6591599999999997E-4,5.92725E-4,6.3899200000000001E-4,6.7179900000000005E-4,6.7513000000000002E-4,7.1179800000000003E-4,7.0081899999999999E-4,7.1545500000000004E-4,6.7717099999999996E-4,6.6018000000000001E-4,6.1264900000000005E-4,5.6001499999999997E-4,4.7643799999999998E-4,4.2448200000000001E-4,3.7562799999999998E-4]
[null,null,null,474,3.4911600000000001E-4,3.96845E-4,4.6664299999999998E-4,5.2467699999999998E-4,5.7605799999999995E-4,6.1733899999999995E-4,6.2473599999999998E-4,6.5244700000000001E-4,6.7145099999999999E-4,6.6895599999999996E-4,6.5015400000000001E-4,6.7143699999999999E-4,6.5362299999999999E-4,6.3769300000000005E-4,5.6504199999999997E-4,5.2415199999999995E-4,4.6649099999999998E-4,4.0597300000000001E-4,3.5933900000000002E-4,3.5784100000000002E-4,3.97785E-4,4.40226E-4,5.2240499999999998E-4,5.5472099999999999E-4,6.1071400000000005E-4,6.4119199999999996E-4,6.3904900000000004E-4,6.7161399999999996E-4,6.6571200000000005E-4,6.9106500000000004E-4,6.6031100000000001E-4,6.3568299999999995E-4,5.8577800000000001E-4,5.3405100000000001E-4,4.4877900000000001E-4,3.8162800000000001E-4,3.4488500000000002E-4]
[null,null,null,475,3.5598100000000001E-4,4.0592900000000002E-4,4.6136099999999998E-4,5.4191700000000005E-4,5.7742000000000004E-4,6.0972700000000001E-4,6.4743299999999999E-4,6.7025099999999996E-4,6.7836299999999997E-4,6.7044499999999998E-4,6.7788699999999996E-4,6.74371E-4,6.5663899999999999E-4,6.1822000000000005E-4,5.6722700000000001E-4,5.5161000000000001E-4,4.71433E-4,4.2846099999999999E-4,3.6823900000000002E-4,3.7446400000000003E-4,4.1974200000000002E-4,4.6894299999999999E-4,5.1092499999999996E-4,5.7128300000000001E-4,6.1205500000000002E-4,6.5274699999999996E-4,6.6745599999999997E-4,6.4869099999999996E-4,6.9970500000000001E-4,7.1046900000000003E-4,6.5482699999999997E-4,6.5105899999999995E-4,5.80172E-4,5.4583400000000003E-4,4.87054E-4,4.0362200000000002E-4,3.43603E-4]
[null,null,null,476,4.1724200000000001E-4,4.4536000000000001E-4,5.3151100000000003E-4,5.6572700000000003E-4,5.8993499999999998E-4,6.4804900000000004E-4,6.7232000000000001E-4,7.2851000000000003E-4,7.4066699999999997E-4,7.1349200000000003E-4,7.0939199999999999E-4,6.9096499999999998E-4,6.8479200000000004E-4,6.5232699999999996E-4,6.3011499999999999E-4,5.4665300000000003E-4,5.2937600000000002E-4,4.64158E-4,3.8709299999999997E-4,4.1088700000000003E-4,4.71781E-4,5.1689699999999999E-4,5.6893700000000005E-4,6.2206900000000005E-4,6.4045599999999997E-4,6.6271199999999998E-4,7.2033299999999998E-4,7.2064999999999998E-4,7.2329000000000002E-4,7.2047099999999998E-4,6.7956500000000003E-4,6.9247199999999997E-4,6.1294099999999998E-4,5.7208499999999995E-4,5.4089399999999999E-4,4.6582600000000002E-4,4.21934E-4]
[null,null,null,477,3.87797E-4,4.4156300000000001E-4,4.8051300000000001E-4,5.4611799999999995E-4,5.9593700000000005E-4,6.37607E-4,6.5689000000000003E-4,7.0575900000000003E-4,7.17119E-4,7.1355400000000003E-4,7.1908699999999998E-4,7.0362799999999998E-4,6.4639799999999996E-4,6.3962199999999996E-4,6.2133399999999997E-4,5.8277100000000005E-4,5.0017099999999999E-4,4.4736E-4,3.9858200000000003E-4,4.0656699999999999E-4,4.62891E-4,5.2619199999999998E-4,5.2630500000000002E-4,6.3210399999999998E-4,6.4112700000000002E-4,6.8324100000000001E-4,6.8623800000000004E-4,6.8905400000000003E-4,7.4078900000000005E-4,7.1267499999999996E-4,6.8274799999999995E-4,6.6981699999999996E-4,6.1034100000000003E-4,5.45708E-4,5.2758600000000003E-4,4.4995000000000001E-4,3.9729199999999999E-4]
[null,null,null,478,3.7795E-4,4.2819899999999998E-4,4.99958E-4,5.3614199999999998E-4,6.21253E-4,6.2401999999999998E-4,6.7659999999999997E-4,6.7786699999999997E-4,6.9656600000000003E-4,6.9305699999999996E-4,6.6790600000000001E-4,6.6692900000000002E-4,6.5736099999999997E-4,6.3989699999999995E-4,6.2410899999999997E-4,5.6459000000000001E-4,4.9452600000000002E-4,4.3679199999999997E-4,3.9382799999999998E-4,4.0114600000000001E-4,4.4481700000000002E-4,4.6790900000000002E-4,5.3382199999999999E-4,5.9819199999999999E-4,6.4632000000000003E-4,6.7002200000000004E-4,6.5856400000000005E-4,6.86263E-4,7.1214900000000003E-4,7.0428899999999998E-4,6.5963399999999998E-4,6.3768699999999995E-4,6.0103000000000001E-4,5.6145800000000003E-4,5.1618599999999997E-4,4.2667300000000003E-4,3.84282E-4]
[null,null,null,479,3.9962199999999998E-4,4.53454E-4,5.0803700000000003E-4,5.7006199999999998E-4,6.4258800000000004E-4,6.2877199999999999E-4,6.9457199999999996E-4,6.9346499999999999E-4,7.2146600000000003E-4,7.0340799999999998E-4,7.0790600000000001E-4,6.9897799999999995E-4,6.8958400000000003E-4,6.53514E-4,6.2043999999999999E-4,5.6978699999999998E-4,5.1389000000000003E-4,4.5553299999999999E-4,4.2079999999999998E-4,3.9890800000000001E-4,4.47887E-4,5.0087700000000005E-4,5.6963200000000004E-4,6.2522299999999995E-4,6.7557800000000003E-4,7.0096799999999995E-4,7.04614E-4,7.1479099999999999E-4,7.2400800000000005E-4,7.0848099999999995E-4,6.8584099999999997E-4,6.7382499999999997E-4,6.1537099999999997E-4,5.8675199999999996E-4,5.4391900000000002E-4,4.6257299999999998E-4,3.9831900000000001E-4]
[null,null,null,480,3.8626600000000002E-4,4.5193700000000002E-4,4.8385099999999999E-4,5.3846000000000005E-4,6.1695100000000002E-4,6.2247099999999998E-4,6.6021799999999996E-4,6.5578200000000004E-4,6.6575100000000002E-4,6.7720200000000001E-4,6.7181000000000001E-4,6.6481199999999998E-4,6.6786899999999997E-4,6.1866099999999995E-4,5.7959899999999998E-4,5.4211099999999996E-4,4.9924400000000003E-4,4.3624899999999999E-4,3.8837499999999999E-4,3.7999399999999998E-4,4.4255800000000001E-4,4.70944E-4,5.4600700000000005E-4,5.6911400000000001E-4,6.3804900000000002E-4,6.23691E-4,6.7907500000000001E-4,6.8232700000000004E-4,6.7583699999999999E-4,6.72009E-4,6.2302899999999999E-4,6.5674400000000001E-4,5.97132E-4,5.5744900000000001E-4,4.9873599999999995E-4,4.4534700000000002E-4,3.7433900000000001E-4]
[null,null,null,481,3.2729699999999999E-4,3.7671299999999998E-4,4.00395E-4,5.0361999999999998E-4,5.3387200000000001E-4,5.45061E-4,5.7809199999999999E-4,6.2261399999999996E-4,6.0654199999999995E-4,6.2135499999999998E-4,6.0640399999999995E-4,6.3221200000000005E-4,5.9898500000000001E-4,5.9193099999999997E-4,5.1995800000000005E-4,4.3610300000000002E-4,4.4735E-4,3.9331199999999999E-4,3.2216599999999998E-4,3.3534500000000002E-4,3.87036E-4,4.3368600000000002E-4,4.9816200000000002E-4,5.0202799999999996E-4,5.8943000000000005E-4,5.7247400000000001E-4,6.1194299999999999E-4,6.0842100000000005E-4,6.1771000000000005E-4,6.2985000000000005E-4,5.8317000000000004E-4,5.5461200000000001E-4,5.4143400000000003E-4,4.8702100000000003E-4,4.5086900000000001E-4,3.8564200000000001E-4,3.20043E-4]
[null,null,null,482,3.4113299999999997E-4,3.9216099999999997E-4,4.43452E-4,4.63222E-4,5.2467699999999998E-4,5.6982799999999998E-4,6.01518E-4,6.1817700000000003E-4,6.1836599999999997E-4,6.1483399999999998E-4,6.2784199999999998E-4,6.0495700000000004E-4,5.8527099999999995E-4,5.8222000000000005E-4,5.4160999999999999E-4,4.8551099999999999E-4,4.3141700000000002E-4,3.8148799999999998E-4,3.3911800000000001E-4,3.2377099999999999E-4,3.9931899999999998E-4,4.1955399999999999E-4,4.8084400000000002E-4,5.3002300000000002E-4,5.5896400000000001E-4,5.6614899999999995E-4,5.9365399999999999E-4,6.1232599999999995E-4,6.4453600000000002E-4,5.9973999999999997E-4,5.6669700000000001E-4,5.6097000000000004E-4,5.1943099999999999E-4,4.7831700000000002E-4,4.3041999999999999E-4,3.7772599999999999E-4,3.1090799999999999E-4]
[null,null,null,483,3.3577299999999999E-4,3.7991799999999998E-4,4.52146E-4,4.9616099999999995E-4,5.3837199999999996E-4,5.7554299999999997E-4,5.78678E-4,6.2743800000000002E-4,6.1733100000000004E-4,6.4467599999999995E-4,6.0108099999999995E-4,6.1832800000000002E-4,5.8557699999999999E-4,5.8100199999999995E-4,5.4669199999999999E-4,4.7767699999999997E-4,4.4349800000000002E-4,3.7527600000000002E-4,3.5484600000000002E-4,3.2962300000000003E-4,4.1097799999999999E-4,4.3428299999999999E-4,4.8468799999999999E-4,5.0041400000000002E-4,5.55706E-4,5.5979300000000005E-4,5.9237700000000005E-4,6.2061600000000005E-4,6.3236599999999998E-4,6.0692799999999996E-4,5.9644799999999997E-4,5.6495299999999998E-4,5.5489700000000005E-4,5.1279299999999999E-4,4.3659299999999999E-4,4.0193899999999997E-4,3.5078699999999997E-4]
[null,null,null,484,3.5321899999999999E-4,3.7062500000000002E-4,4.32855E-4,5.2788399999999995E-4,5.4205400000000004E-4,5.47498E-4,6.0004299999999997E-4,6.1813099999999995E-4,6.2026699999999998E-4,6.2380499999999995E-4,6.0647100000000003E-4,5.9810400000000002E-4,6.1699900000000002E-4,5.6908299999999996E-4,5.5406100000000001E-4,4.6905999999999998E-4,4.44206E-4,3.9202799999999999E-4,3.5446499999999999E-4,3.4224100000000002E-4,3.95726E-4,4.38195E-4,4.8093300000000001E-4,5.1813399999999996E-4,5.6059199999999995E-4,5.76075E-4,6.0400000000000004E-4,6.0649100000000002E-4,6.2814999999999995E-4,6.1526400000000002E-4,5.8411300000000004E-4,5.69533E-4,5.4622500000000001E-4,5.0758300000000004E-4,4.4382100000000001E-4,3.8656999999999998E-4,3.4735899999999999E-4]
[null,null,null,485,3.62519E-4,4.1903200000000001E-4,4.3943200000000002E-4,5.2008800000000004E-4,5.3818099999999999E-4,5.7255999999999995E-4,6.1413799999999997E-4,6.2083600000000004E-4,6.2673399999999999E-4,6.2758400000000004E-4,6.1863300000000005E-4,6.2129899999999996E-4,6.3728299999999999E-4,5.9308099999999997E-4,5.5975399999999998E-4,4.9400099999999999E-4,4.5623300000000001E-4,4.2006299999999998E-4,3.6254899999999999E-4,3.4632400000000001E-4,4.2381800000000001E-4,4.5237599999999999E-4,4.9005200000000004E-4,5.4591700000000004E-4,5.7121699999999995E-4,6.09072E-4,6.2797899999999997E-4,6.0840000000000004E-4,6.4166400000000001E-4,6.3053299999999996E-4,6.0093899999999999E-4,5.7328999999999995E-4,5.4614500000000005E-4,5.0914000000000005E-4,4.2464999999999999E-4,3.9389399999999999E-4,3.6198900000000001E-4]
[null,null,null,486,3.3524500000000002E-4,3.6999100000000002E-4,4.2295700000000001E-4,4.6992600000000001E-4,5.0940200000000005E-4,5.5332099999999996E-4,5.7420599999999996E-4,5.6361900000000001E-4,5.8080399999999998E-4,6.0544199999999998E-4,5.6878799999999998E-4,6.0037100000000004E-4,5.7399100000000004E-4,5.7700799999999995E-4,5.3783599999999998E-4,5.0320900000000001E-4,4.1335200000000002E-4,3.6339199999999998E-4,3.1764599999999999E-4,3.3370399999999999E-4,3.90617E-4,4.2847300000000002E-4,4.88624E-4,4.9750200000000004E-4,5.3199599999999997E-4,5.5864200000000004E-4,5.9519800000000002E-4,6.0805099999999997E-4,5.9952099999999999E-4,6.3279999999999999E-4,5.7863299999999995E-4,5.7967000000000001E-4,5.14701E-4,4.9413199999999999E-4,4.15158E-4,3.7665799999999998E-4,3.6529599999999998E-4]
[null,null,null,487,3.4890600000000001E-4,3.7769499999999999E-4,4.7400600000000002E-4,5.0349499999999996E-4,5.4573200000000005E-4,5.82293E-4,6.0684499999999995E-4,6.1921299999999997E-4,6.3215700000000005E-4,6.62011E-4,6.0453199999999996E-4,6.4990000000000002E-4,6.2020399999999996E-4,5.8081300000000001E-4,5.5512599999999997E-4,5.1438600000000003E-4,4.7509700000000001E-4,4.1226099999999998E-4,3.5298799999999999E-4,3.56535E-4,4.1279100000000003E-4,4.55816E-4,5.2009099999999998E-4,5.3984400000000004E-4,5.8579900000000002E-4,5.6256700000000004E-4,6.1379499999999999E-4,6.3056199999999998E-4,6.2120899999999995E-4,6.2105099999999996E-4,6.1856699999999999E-4,5.9009600000000002E-4,5.6689499999999999E-4,5.0240400000000002E-4,4.6856000000000003E-4,3.9390200000000001E-4,3.5639200000000003E-4]
[null,null,null,488,2.8914199999999999E-4,3.2891700000000002E-4,3.7865000000000002E-4,4.59617E-4,4.7279800000000002E-4,5.1585800000000001E-4,5.3004799999999998E-4,5.3695000000000001E-4,5.5587500000000005E-4,5.6410200000000003E-4,5.4061500000000004E-4,5.5446599999999999E-4,5.4631299999999999E-4,5.2524600000000005E-4,4.9583799999999996E-4,4.4126300000000001E-4,3.8966800000000002E-4,3.3105899999999998E-4,2.8774600000000002E-4,2.8615999999999998E-4,3.56373E-4,3.9667499999999998E-4,4.3208199999999997E-4,4.5261800000000001E-4,5.0061099999999998E-4,5.3042300000000003E-4,5.6956800000000001E-4,5.5351E-4,5.6964500000000003E-4,5.5523300000000003E-4,5.3447599999999998E-4,4.9833899999999999E-4,4.71457E-4,4.4882E-4,3.8046500000000002E-4,3.1745800000000001E-4,2.8372E-4]
[null,null,null,489,3.1837199999999998E-4,3.7911299999999999E-4,4.3590000000000002E-4,4.8937399999999999E-4,5.2612100000000005E-4,5.5687300000000005E-4,5.7671700000000003E-4,5.7112600000000003E-4,5.8780300000000002E-4,6.1549100000000002E-4,6.1411300000000001E-4,5.99005E-4,5.8138700000000005E-4,5.5659600000000002E-4,5.4565400000000002E-4,4.8899399999999997E-4,4.2995899999999999E-4,3.5883300000000003E-4,3.4523799999999999E-4,3.4564200000000001E-4,4.1574599999999999E-4,4.4685999999999999E-4,4.86878E-4,5.1293499999999995E-4,5.5693799999999999E-4,5.97683E-4,5.8583799999999998E-4,5.90969E-4,6.14271E-4,5.9681999999999997E-4,5.8562999999999996E-4,5.5632299999999995E-4,5.2758899999999997E-4,4.9110099999999997E-4,4.3595400000000001E-4,3.8181700000000001E-4,3.3395700000000001E-4]
[null,null,null,490,3.1393099999999999E-4,3.7228000000000001E-4,4.3915300000000002E-4,4.7619699999999998E-4,5.02809E-4,5.2407799999999998E-4,5.5917599999999999E-4,5.8421799999999996E-4,5.8967100000000005E-4,5.9479599999999997E-4,5.9466900000000004E-4,5.84193E-4,5.7262600000000002E-4,5.4633999999999998E-4,5.1848699999999998E-4,4.7968899999999999E-4,4.4177099999999998E-4,3.5566100000000001E-4,3.2649799999999999E-4,3.4209099999999999E-4,3.87074E-4,4.32879E-4,4.5279400000000002E-4,4.8703700000000001E-4,5.3187099999999995E-4,5.7981199999999997E-4,5.7066799999999998E-4,5.7492100000000005E-4,6.0430599999999998E-4,6.0126000000000005E-4,5.7071800000000001E-4,5.43491E-4,5.03167E-4,4.6805600000000001E-4,4.21321E-4,3.6279900000000002E-4,3.1175799999999998E-4]
[null,null,null,491,3.5288000000000002E-4,4.3735099999999999E-4,4.5876700000000001E-4,4.9558299999999996E-4,5.6188099999999997E-4,5.6295E-4,6.0811700000000003E-4,6.5478300000000004E-4,6.4128500000000001E-4,6.5235599999999999E-4,6.3560099999999996E-4,6.1855500000000002E-4,6.1460099999999999E-4,5.8415300000000002E-4,5.4386400000000002E-4,5.2521999999999996E-4,4.8759200000000002E-4,4.2871000000000001E-4,3.6578799999999997E-4,3.77196E-4,4.19882E-4,4.5170799999999999E-4,4.8710700000000002E-4,5.5932499999999995E-4,5.9413599999999999E-4,6.2397799999999997E-4,5.9842800000000002E-4,6.4776799999999995E-4,6.4020500000000003E-4,6.3393300000000004E-4,6.0511600000000005E-4,5.8173100000000004E-4,5.8489900000000005E-4,5.1441200000000001E-4,4.5975600000000002E-4,4.1263999999999998E-4,3.8245599999999999E-4]
[null,null,null,492,3.4640000000000002E-4,3.6123200000000001E-4,4.4329100000000001E-4,4.91371E-4,5.2778199999999997E-4,5.6510499999999999E-4,6.0588299999999999E-4,6.0112900000000005E-4,6.0700800000000003E-4,6.2071399999999997E-4,6.2089700000000003E-4,6.2251899999999998E-4,5.6916200000000001E-4,5.8050599999999995E-4,5.2948700000000003E-4,5.1185E-4,4.3490400000000001E-4,3.9005600000000001E-4,3.3537299999999998E-4,3.2059800000000001E-4,4.1290000000000001E-4,4.5557600000000002E-4,4.9715200000000005E-4,5.2114200000000005E-4,5.7195100000000001E-4,5.9168399999999998E-4,5.8905700000000004E-4,6.1724399999999997E-4,6.0773900000000004E-4,6.0622900000000001E-4,5.9201299999999996E-4,5.7006600000000004E-4,5.4865800000000004E-4,4.9731099999999996E-4,4.36346E-4,3.9810699999999997E-4,3.4587700000000002E-4]
[null,null,null,493,3.1912899999999997E-4,3.8062799999999999E-4,4.3452900000000001E-4,4.7758099999999998E-4,5.1336800000000005E-4,5.6420000000000005E-4,5.9977000000000001E-4,5.8681800000000002E-4,6.0553199999999999E-4,6.3311800000000001E-4,6.0178E-4,6.0495600000000003E-4,5.8411300000000004E-4,5.9457300000000004E-4,5.4592799999999999E-4,5.1410400000000004E-4,4.3644799999999998E-4,3.9639999999999999E-4,3.52135E-4,3.5323899999999998E-4,4.0720300000000002E-4,4.6086800000000002E-4,4.8918599999999996E-4,5.1658300000000004E-4,5.6956300000000004E-4,5.8084E-4,5.7921299999999997E-4,5.9378999999999996E-4,5.9952400000000004E-4,6.0145700000000001E-4,5.6128199999999997E-4,5.8305499999999997E-4,5.52938E-4,5.1438199999999997E-4,4.3713999999999998E-4,3.9610600000000002E-4,3.4239300000000003E-4]
[null,null,null,494,3.40673E-4,3.80563E-4,4.1893699999999998E-4,4.9599300000000002E-4,5.1814999999999999E-4,5.5491000000000004E-4,5.6997899999999997E-4,6.1493500000000005E-4,6.1967100000000002E-4,6.2138999999999998E-4,6.2227300000000001E-4,6.1774599999999996E-4,6.1045399999999997E-4,5.7671899999999995E-4,5.3782500000000002E-4,5.1243000000000003E-4,4.51316E-4,3.9773500000000003E-4,3.3568399999999999E-4,3.4662499999999998E-4,4.1230800000000001E-4,4.40381E-4,4.9195200000000004E-4,5.0702899999999999E-4,5.5183499999999998E-4,6.0225100000000004E-4,6.1196899999999997E-4,5.9976500000000004E-4,6.0777800000000001E-4,6.2262299999999999E-4,5.8612300000000003E-4,5.6770300000000002E-4,5.1391299999999996E-4,4.9796699999999998E-4,4.3009299999999999E-4,3.8832800000000001E-4,3.2863800000000002E-4]
[null,null,null,495,3.1045900000000002E-4,3.5437700000000001E-4,4.1661600000000002E-4,4.58925E-4,5.03291E-4,5.4709799999999999E-4,5.6060699999999997E-4,5.8378300000000004E-4,5.8853200000000001E-4,5.8726199999999996E-4,5.8665699999999998E-4,5.8452600000000003E-4,5.6209499999999998E-4,5.4313799999999998E-4,5.0925199999999997E-4,4.7384599999999999E-4,4.0244499999999997E-4,3.8146099999999999E-4,3.1503199999999997E-4,3.09291E-4,3.9301199999999998E-4,4.0700000000000003E-4,4.5195400000000002E-4,4.8711199999999999E-4,5.36777E-4,5.4603599999999996E-4,5.8544700000000001E-4,5.7866199999999997E-4,5.9575199999999996E-4,5.7484699999999997E-4,5.7464099999999998E-4,5.6284100000000001E-4,4.9496299999999996E-4,4.4180499999999998E-4,4.1774100000000001E-4,3.59527E-4,3.1097399999999999E-4]
[null,null,null,496,2.8116099999999999E-4,3.4535799999999998E-4,4.1711899999999998E-4,4.4282399999999997E-4,4.8086800000000002E-4,5.0571999999999998E-4,5.2909699999999997E-4,5.88063E-4,5.7473300000000001E-4,5.65849E-4,5.5165900000000003E-4,5.54804E-4,5.3143500000000002E-4,5.31344E-4,4.7181799999999999E-4,4.4477699999999999E-4,3.92517E-4,3.4539599999999998E-4,2.8028800000000001E-4,2.8070299999999999E-4,3.4637999999999997E-4,3.9964699999999999E-4,4.3069400000000002E-4,4.5040500000000002E-4,5.3963000000000004E-4,5.2950800000000004E-4,5.4383399999999998E-4,5.5675799999999997E-4,5.7233200000000005E-4,5.4635800000000004E-4,5.3144900000000003E-4,5.2215499999999995E-4,4.6090200000000001E-4,4.27339E-4,3.8903700000000001E-4,3.6102999999999998E-4,2.8477100000000002E-4]
[null,null,null,497,2.8541299999999999E-4,3.5631699999999998E-4,4.41765E-4,4.7256400000000002E-4,4.9878900000000002E-4,5.4689099999999998E-4,5.5381199999999999E-4,6.0136499999999997E-4,5.9798700000000002E-4,6.0077000000000004E-4,5.9716800000000003E-4,5.8501199999999999E-4,5.4556600000000004E-4,5.4494700000000005E-4,4.79094E-4,4.8262400000000002E-4,4.2198099999999998E-4,3.5717000000000002E-4,3.2429099999999999E-4,3.1319900000000001E-4,3.6940600000000002E-4,4.2364900000000001E-4,4.5057099999999998E-4,4.8920699999999997E-4,5.2275300000000004E-4,5.6953500000000003E-4,5.6731299999999995E-4,6.0450100000000002E-4,6.2000599999999999E-4,6.0095799999999996E-4,5.7665799999999997E-4,5.4762799999999998E-4,5.1948800000000002E-4,4.70507E-4,4.0738900000000003E-4,3.9648599999999998E-4,3.1433699999999998E-4]
[null,null,null,498,3.1033100000000001E-4,3.6822599999999998E-4,4.1799600000000001E-4,4.7055900000000001E-4,5.07732E-4,5.5152100000000002E-4,5.9495499999999998E-4,5.8661200000000003E-4,6.2434000000000003E-4,6.1487300000000005E-4,6.0655300000000002E-4,5.6413199999999996E-4,5.7240199999999996E-4,5.4527700000000004E-4,5.1866900000000003E-4,4.8366799999999998E-4,4.4579E-4,3.8385300000000003E-4,3.2934799999999998E-4,3.16628E-4,3.61758E-4,4.07308E-4,4.9111300000000005E-4,5.1578400000000003E-4,5.3358400000000003E-4,6.1256400000000001E-4,5.6812599999999996E-4,5.7411199999999999E-4,6.0055899999999997E-4,5.8919199999999999E-4,5.7199599999999996E-4,5.81721E-4,5.11478E-4,4.87811E-4,4.2585799999999999E-4,3.9772899999999999E-4,3.0802800000000001E-4]
[null,null,null,499,3.1818299999999999E-4,3.8289800000000001E-4,4.43404E-4,4.8042099999999997E-4,5.1993099999999995E-4,5.7294699999999997E-4,5.9963300000000002E-4,5.8054899999999997E-4,6.1499899999999997E-4,6.1336699999999997E-4,6.0895899999999995E-4,5.8491299999999995E-4,5.6890900000000004E-4,5.6571099999999999E-4,5.0987299999999999E-4,4.7220200000000002E-4,4.3037000000000001E-4,3.8492499999999999E-4,3.1652399999999999E-4,3.22505E-4,3.7963599999999998E-4,4.41865E-4,4.8688699999999998E-4,5.2231200000000004E-4,5.4571700000000003E-4,5.7834100000000001E-4,5.9316600000000001E-4,6.0111500000000005E-4,6.0131200000000001E-4,6.0916599999999996E-4,5.7031400000000004E-4,5.8355699999999996E-4,5.0928699999999998E-4,4.7734699999999998E-4,4.2692499999999998E-4,3.8058299999999998E-4,3.0594200000000002E-4]
[null,null,null,500,3.1540099999999998E-4,3.7654399999999998E-4,4.2333099999999999E-4,4.8392999999999998E-4,5.2952299999999995E-4,5.6279699999999997E-4,5.7010700000000004E-4,5.8746299999999998E-4,6.1030399999999999E-4,6.13183E-4,5.9732700000000004E-4,5.7850399999999998E-4,5.81983E-4,5.6274000000000005E-4,5.2038200000000001E-4,4.8152999999999998E-4,4.3242699999999999E-4,3.9082899999999998E-4,3.16084E-4,3.1832200000000001E-4,3.8558100000000002E-4,4.4799100000000001E-4,4.6663999999999999E-4,5.20099E-4,5.5165399999999995E-4,5.7221500000000005E-4,5.8784199999999999E-4,5.9167400000000004E-4,6.0956599999999997E-4,6.0788400000000005E-4,5.8941400000000002E-4,5.8370299999999998E-4,5.3386000000000004E-4,4.70734E-4,4.3346299999999998E-4,3.6519900000000002E-4,3.1041199999999998E-4]
[null,null,null,501,3.1172300000000002E-4,3.9244600000000002E-4,4.0360400000000001E-4,4.6893299999999999E-4,5.2780500000000001E-4,5.7539400000000001E-4,5.7977799999999998E-4,6.0617500000000003E-4,5.9044800000000004E-4,6.1416800000000001E-4,6.0848499999999997E-4,6.07096E-4,5.9730099999999995E-4,5.4234499999999996E-4,5.4339600000000003E-4,4.7630699999999998E-4,4.1951999999999999E-4,3.7721599999999999E-4,3.2553200000000001E-4,3.2071900000000002E-4,3.9485600000000002E-4,4.3613099999999998E-4,4.7981899999999998E-4,5.20306E-4,5.5985500000000005E-4,5.7175499999999996E-4,5.9375400000000005E-4,5.8993200000000004E-4,6.1158000000000002E-4,6.1977899999999999E-4,5.7857000000000004E-4,5.6791199999999995E-4,5.2995099999999997E-4,4.7754999999999998E-4,3.9720599999999999E-4,3.8331299999999998E-4,3.1578500000000001E-4]
[null,null,null,502,3.3685699999999998E-4,4.1348900000000001E-4,4.3862799999999999E-4,5.0023199999999998E-4,5.3196799999999996E-4,6.1611700000000001E-4,6.1210099999999999E-4,6.2479500000000004E-4,6.49644E-4,6.6370399999999999E-4,6.5785699999999997E-4,6.2774499999999997E-4,6.40031E-4,5.9891000000000002E-4,5.4841199999999997E-4,5.1668899999999997E-4,4.7134E-4,3.8982200000000001E-4,3.5372000000000002E-4,3.4918900000000002E-4,4.0460099999999998E-4,4.7361799999999998E-4,5.28156E-4,5.5817599999999996E-4,6.0429099999999996E-4,6.1673900000000005E-4,6.3236800000000001E-4,6.3217099999999995E-4,6.4826900000000004E-4,6.4699600000000005E-4,6.1876399999999995E-4,5.9275599999999995E-4,5.2672699999999995E-4,4.9073699999999999E-4,4.7916300000000001E-4,4.0608300000000001E-4,3.31725E-4]
[null,null,null,503,3.5079000000000002E-4,3.68871E-4,4.1853000000000002E-4,4.9594699999999995E-4,5.3350999999999995E-4,5.9207699999999999E-4,5.8379199999999997E-4,6.1869400000000004E-4,6.44307E-4,6.4724100000000001E-4,6.1850399999999997E-4,5.9575700000000004E-4,6.0469500000000004E-4,5.6606899999999999E-4,5.5177100000000005E-4,4.90779E-4,4.3414400000000002E-4,3.87783E-4,3.3428800000000002E-4,3.3725299999999998E-4,3.84767E-4,4.58825E-4,4.8376099999999998E-4,5.2762000000000002E-4,5.9020600000000002E-4,6.1308200000000004E-4,6.2010699999999995E-4,5.9438999999999998E-4,6.1235499999999997E-4,6.3064200000000005E-4,5.8934500000000002E-4,5.7678700000000005E-4,5.2562099999999999E-4,5.0329599999999997E-4,4.2765799999999998E-4,4.0518800000000001E-4,3.5020500000000003E-4]
[null,null,null,504,3.5442299999999998E-4,3.86709E-4,4.5124999999999999E-4,5.4790199999999996E-4,5.6877999999999996E-4,5.9545099999999999E-4,6.1525800000000004E-4,6.4371700000000003E-4,6.5857999999999997E-4,6.5777999999999995E-4,6.4044799999999995E-4,6.4209100000000002E-4,6.3621299999999995E-4,6.1308300000000005E-4,5.6041200000000004E-4,5.0047899999999996E-4,4.5523599999999998E-4,4.2330500000000001E-4,3.7063900000000003E-4,3.6217699999999999E-4,4.1155800000000002E-4,4.8027399999999999E-4,5.1650999999999997E-4,5.5575100000000005E-4,5.9400100000000003E-4,6.2227799999999998E-4,6.3364499999999995E-4,6.3641200000000005E-4,6.4402199999999995E-4,6.2838E-4,6.4585599999999999E-4,6.0994900000000004E-4,5.4155000000000002E-4,5.2217400000000003E-4,4.7982299999999999E-4,3.8586499999999999E-4,3.3850999999999998E-4]
[null,null,null,505,3.4739299999999999E-4,3.9188800000000001E-4,4.53227E-4,5.08393E-4,5.5138699999999997E-4,6.0122400000000003E-4,6.0105599999999999E-4,6.4711499999999997E-4,6.3026499999999997E-4,6.54051E-4,6.5430200000000005E-4,6.3639800000000004E-4,6.3704799999999998E-4,5.9469700000000004E-4,5.6037899999999996E-4,4.9175100000000002E-4,4.4321200000000001E-4,3.9398299999999999E-4,3.4530200000000002E-4,3.4143500000000001E-4,3.9555800000000001E-4,4.5759400000000002E-4,5.2272899999999999E-4,5.5694299999999996E-4,5.8166700000000001E-4,6.1547999999999996E-4,6.4100599999999995E-4,6.2977200000000001E-4,6.35631E-4,6.2052799999999997E-4,6.3541800000000001E-4,5.8924599999999998E-4,5.6299300000000002E-4,5.0406500000000005E-4,4.8045899999999998E-4,3.90555E-4,3.3219599999999999E-4]
[null,null,null,506,3.5895499999999999E-4,4.23655E-4,4.8382900000000002E-4,5.3348499999999999E-4,5.5144999999999999E-4,6.0087599999999997E-4,6.4545499999999997E-4,6.6762099999999997E-4,6.6351799999999999E-4,6.8454900000000001E-4,6.4898099999999997E-4,6.5031599999999996E-4,6.2266100000000005E-4,6.1908999999999998E-4,5.7493799999999999E-4,5.0885999999999998E-4,4.34187E-4,4.12431E-4,3.4657600000000002E-4,3.6922799999999998E-4,4.1324800000000001E-4,4.61411E-4,5.32384E-4,5.7074100000000004E-4,6.1680800000000005E-4,6.2905199999999995E-4,6.4641799999999995E-4,6.5799599999999999E-4,6.6238500000000004E-4,6.6358300000000003E-4,6.5780400000000001E-4,6.2909700000000001E-4,5.9243700000000002E-4,4.8952900000000005E-4,4.84802E-4,4.0670399999999997E-4,3.6207500000000001E-4]
[null,null,null,507,3.7390200000000001E-4,4.4214500000000002E-4,4.9776900000000001E-4,5.6408499999999998E-4,5.9848599999999996E-4,6.3706199999999998E-4,6.6991999999999996E-4,6.7470300000000002E-4,6.8937800000000004E-4,6.6859999999999999E-4,6.9440500000000004E-4,6.8352599999999995E-4,6.4928100000000003E-4,6.5200700000000002E-4,5.8424499999999995E-4,5.4688800000000004E-4,4.7480299999999999E-4,4.5069100000000003E-4,3.6238999999999998E-4,3.7747099999999999E-4,4.3657599999999999E-4,4.9724700000000003E-4,5.5964199999999995E-4,6.2245099999999999E-4,6.4924899999999996E-4,6.7474899999999999E-4,6.6607700000000005E-4,6.8255799999999999E-4,7.1208999999999997E-4,7.0082100000000002E-4,6.7578699999999996E-4,6.3600199999999999E-4,5.8567199999999997E-4,5.5444999999999995E-4,4.7735799999999999E-4,4.39228E-4,3.9033600000000002E-4]
[null,null,null,508,3.6990699999999999E-4,4.53468E-4,5.1265700000000002E-4,5.95149E-4,6.3763199999999996E-4,6.6608100000000001E-4,7.0917500000000004E-4,7.27475E-4,7.6674200000000005E-4,7.1706999999999999E-4,7.0064200000000002E-4,7.3477899999999997E-4,6.8343600000000005E-4,6.7206600000000003E-4,6.4456500000000005E-4,5.8402300000000003E-4,5.4469499999999999E-4,4.8074199999999999E-4,4.0354600000000002E-4,3.7424700000000002E-4,4.8386099999999998E-4,5.3143999999999999E-4,5.6858899999999999E-4,6.4471299999999999E-4,6.8284300000000004E-4,7.0036600000000001E-4,7.0721900000000003E-4,6.9485800000000002E-4,7.3422899999999998E-4,7.2345199999999997E-4,6.9542900000000001E-4,7.1022100000000003E-4,6.2515900000000002E-4,5.8933200000000003E-4,5.3876599999999998E-4,4.7632499999999999E-4,4.0464199999999998E-4]
[null,null,null,509,3.65538E-4,4.0952000000000002E-4,5.1214900000000005E-4,5.6335999999999995E-4,6.1584400000000005E-4,6.2927199999999995E-4,6.8410499999999996E-4,6.9804000000000003E-4,7.3462099999999997E-4,7.1525099999999997E-4,7.0881999999999998E-4,6.9649299999999996E-4,6.8126099999999995E-4,6.6110099999999998E-4,6.2163300000000002E-4,5.9915800000000003E-4,5.03029E-4,4.5175499999999997E-4,3.8299999999999999E-4,3.9121300000000001E-4,4.5568699999999998E-4,5.0164199999999995E-4,5.65133E-4,6.1785200000000001E-4,6.7429800000000004E-4,7.0039400000000002E-4,6.9102900000000001E-4,6.9137599999999995E-4,7.01715E-4,7.0354900000000004E-4,6.8166699999999995E-4,6.7004599999999999E-4,6.4879800000000002E-4,5.7171900000000005E-4,5.2442500000000002E-4,4.5605500000000002E-4,3.8910700000000003E-4]
[null,null,null,510,3.6178099999999998E-4,4.2262099999999998E-4,4.82437E-4,5.7483100000000004E-4,6.0365699999999996E-4,6.4841599999999997E-4,6.7510699999999999E-4,6.9481399999999998E-4,7.0661200000000002E-4,7.0313600000000004E-4,6.8945400000000004E-4,6.8556400000000005E-4,6.5365300000000002E-4,6.3729300000000004E-4,5.9839099999999998E-4,5.6295499999999997E-4,4.7672799999999999E-4,4.16594E-4,3.5932500000000002E-4,3.7668599999999999E-4,4.24437E-4,4.9299399999999996E-4,5.4782799999999999E-4,6.0724100000000001E-4,6.7588100000000003E-4,6.82765E-4,6.7526700000000001E-4,6.8273900000000002E-4,6.9117199999999999E-4,6.9153300000000003E-4,6.8117399999999999E-4,6.4929300000000001E-4,6.1282299999999997E-4,5.5108399999999997E-4,4.9110699999999996E-4,4.3852799999999999E-4,3.5902900000000002E-4]
[null,null,null,511,4.1152099999999998E-4,5.0039699999999997E-4,5.2387199999999999E-4,6.1646900000000002E-4,6.4828800000000001E-4,6.7823799999999995E-4,7.3057899999999997E-4,7.5213700000000005E-4,7.6471899999999997E-4,7.6556900000000002E-4,7.49682E-4,7.4737999999999996E-4,7.2367899999999997E-4,6.8914599999999996E-4,6.49327E-4,5.9623E-4,5.3148400000000004E-4,4.7988300000000001E-4,4.2922400000000002E-4,4.0631599999999999E-4,4.6656399999999999E-4,5.5171099999999998E-4,6.1912999999999996E-4,6.6272300000000004E-4,7.0005499999999999E-4,7.3740600000000002E-4,7.1384200000000001E-4,7.4459299999999999E-4,7.5830899999999998E-4,7.3793999999999997E-4,7.3644800000000001E-4,7.1391499999999997E-4,6.6701E-4,6.0495799999999995E-4,5.3417799999999995E-4,4.9024500000000005E-4,4.0680499999999999E-4]
[null,null,null,512,4.03335E-4,4.7999199999999999E-4,5.1776399999999998E-4,6.2019899999999999E-4,6.5610699999999996E-4,6.9022400000000002E-4,7.2489699999999995E-4,7.2833800000000003E-4,7.3826000000000002E-4,7.5582999999999998E-4,7.4861199999999995E-4,7.3567700000000001E-4,7.1494600000000005E-4,6.5650699999999997E-4,6.4410800000000001E-4,6.07371E-4,5.4562499999999999E-4,4.68431E-4,4.16291E-4,4.0068500000000002E-4,4.7338700000000003E-4,5.2524199999999998E-4,5.7439299999999997E-4,6.7917599999999998E-4,6.8087499999999995E-4,7.2648099999999996E-4,7.2252500000000001E-4,7.5479099999999999E-4,7.4050799999999996E-4,7.3842600000000003E-4,7.0066400000000004E-4,6.6150599999999996E-4,6.5944099999999998E-4,5.9900299999999997E-4,5.3835299999999999E-4,4.5038800000000003E-4,3.8444899999999998E-4]
[null,null,null,513,3.7856499999999998E-4,4.4516199999999998E-4,5.1822999999999995E-4,5.7874999999999995E-4,6.54333E-4,6.7057200000000003E-4,7.0371599999999996E-4,7.1960999999999998E-4,7.4810700000000003E-4,7.3665099999999995E-4,7.24638E-4,7.4540800000000003E-4,7.3688599999999996E-4,6.7015399999999995E-4,6.2475699999999998E-4,5.6192600000000003E-4,5.0899599999999995E-4,4.5529400000000002E-4,3.9316399999999999E-4,4.08816E-4,4.5963699999999999E-4,5.0506699999999999E-4,5.7779700000000001E-4,6.4223000000000004E-4,6.8780299999999996E-4,7.1854500000000001E-4,7.2035899999999995E-4,7.2914300000000002E-4,7.3244100000000002E-4,7.4946599999999996E-4,7.0114600000000004E-4,6.7203399999999996E-4,6.3594699999999999E-4,5.6089900000000001E-4,5.3979199999999998E-4,4.4368599999999999E-4,3.5712E-4]
[null,null,null,514,3.6461700000000002E-4,4.5975900000000001E-4,5.2927300000000003E-4,5.6997000000000005E-4,6.4113799999999997E-4,6.9191499999999998E-4,7.01095E-4,7.1920700000000003E-4,7.4312499999999997E-4,7.4365E-4,7.1885899999999997E-4,7.3822600000000003E-4,6.9372800000000001E-4,6.7778100000000002E-4,6.4496099999999999E-4,5.94605E-4,5.1968700000000001E-4,4.6473899999999998E-4,3.88551E-4,3.85831E-4,4.5489700000000001E-4,5.0755400000000001E-4,5.6983399999999997E-4,6.2619200000000002E-4,6.9252799999999998E-4,6.97735E-4,7.37074E-4,7.3671399999999997E-4,7.5868099999999998E-4,7.3391500000000002E-4,7.1111899999999997E-4,6.8177400000000001E-4,6.5804299999999997E-4,5.7409799999999999E-4,5.1476699999999996E-4,4.7742500000000002E-4,3.9384799999999997E-4]
[null,null,null,515,3.9302899999999998E-4,4.6846499999999999E-4,5.4539300000000003E-4,6.0879300000000005E-4,6.2665699999999997E-4,6.83206E-4,7.2119800000000004E-4,7.4993499999999997E-4,7.3661400000000002E-4,7.6220900000000002E-4,7.3904999999999999E-4,7.4429400000000005E-4,7.2959700000000001E-4,6.5863499999999997E-4,6.7117900000000005E-4,5.9684500000000004E-4,5.3255200000000005E-4,4.6506500000000002E-4,4.0526100000000002E-4,3.8392299999999999E-4,4.6656900000000001E-4,5.31764E-4,5.96388E-4,6.4482600000000004E-4,6.7924999999999995E-4,7.1293500000000004E-4,7.4176699999999995E-4,7.3848100000000003E-4,7.7289700000000004E-4,7.4319900000000005E-4,7.3875999999999998E-4,7.0438200000000003E-4,6.5733000000000002E-4,6.03653E-4,5.3666599999999999E-4,4.66651E-4,3.8181199999999998E-4]
[null,null,null,516,4.2868799999999999E-4,4.8393399999999999E-4,5.4882200000000003E-4,6.3980299999999999E-4,6.6775000000000005E-4,7.3401399999999996E-4,7.5562800000000005E-4,7.8254699999999997E-4,7.9893900000000003E-4,7.6831200000000005E-4,7.9375099999999998E-4,7.7774599999999995E-4,7.6292700000000005E-4,6.9533300000000002E-4,7.0074500000000001E-4,6.1091499999999996E-4,5.58392E-4,4.8949300000000002E-4,4.2967599999999998E-4,4.2738500000000002E-4,4.9277499999999998E-4,5.7249299999999998E-4,6.3464200000000004E-4,6.7624299999999998E-4,7.0996799999999995E-4,7.4255600000000001E-4,7.7879399999999997E-4,7.7832800000000001E-4,7.87066E-4,7.8032600000000002E-4,7.7704399999999996E-4,7.3574000000000003E-4,6.8987699999999998E-4,6.2873900000000001E-4,5.5927699999999995E-4,4.8309299999999998E-4,4.17117E-4]
[null,null,null,517,4.3688899999999998E-4,5.0648900000000005E-4,5.7582599999999999E-4,6.4407099999999997E-4,6.7040199999999996E-4,7.2814400000000001E-4,7.5938999999999998E-4,7.9675199999999996E-4,8.1158599999999999E-4,7.7443599999999998E-4,7.8315899999999996E-4,7.9674399999999995E-4,7.5498199999999996E-4,7.3676500000000001E-4,6.9740500000000001E-4,6.37979E-4,5.8338900000000002E-4,5.33589E-4,4.5068899999999999E-4,4.5411300000000002E-4,4.9512099999999995E-4,5.5858600000000002E-4,6.2368000000000005E-4,6.8048499999999999E-4,7.2322399999999996E-4,7.8184800000000003E-4,7.9207699999999997E-4,7.8807499999999995E-4,7.90812E-4,8.0033199999999995E-4,7.5401199999999998E-4,7.4060200000000004E-4,6.8909500000000003E-4,6.3826400000000004E-4,5.6879499999999998E-4,5.1508399999999996E-4,4.2273300000000001E-4]
[null,null,null,518,4.1081700000000001E-4,4.7168399999999999E-4,5.2679300000000001E-4,5.9734800000000004E-4,6.63016E-4,7.0523299999999999E-4,7.3172799999999996E-4,7.3799E-4,7.6384100000000002E-4,7.3440500000000004E-4,7.6139000000000003E-4,7.8741200000000003E-4,7.3671900000000005E-4,7.0316499999999995E-4,6.5658899999999996E-4,5.8221800000000002E-4,5.2198299999999995E-4,4.6488500000000001E-4,4.1899500000000002E-4,4.1782000000000001E-4,4.8334199999999999E-4,5.5383799999999996E-4,5.83071E-4,6.2925100000000005E-4,6.9551599999999997E-4,7.2980600000000005E-4,7.3395600000000002E-4,7.5366799999999998E-4,7.6666199999999999E-4,7.55143E-4,7.3105299999999995E-4,7.0097400000000004E-4,6.8062600000000004E-4,5.8728999999999997E-4,5.68769E-4,4.5360600000000001E-4,3.8342900000000002E-4]
[null,null,null,519,3.9478700000000001E-4,4.8141699999999999E-4,5.4749900000000001E-4,6.0764399999999996E-4,6.7825199999999996E-4,7.1515299999999995E-4,7.4165400000000001E-4,7.5142299999999998E-4,7.7451500000000003E-4,7.6206500000000003E-4,7.6961E-4,7.6808200000000001E-4,7.4672499999999995E-4,7.1291499999999995E-4,6.7805800000000005E-4,6.1338699999999996E-4,5.6789999999999998E-4,4.7933900000000001E-4,3.8741099999999999E-4,4.31901E-4,4.7375899999999997E-4,5.4115599999999999E-4,5.9654599999999999E-4,6.44803E-4,6.9829199999999999E-4,7.6379799999999999E-4,7.8427200000000003E-4,7.8005399999999997E-4,7.6548899999999995E-4,7.8649600000000003E-4,7.5543400000000003E-4,7.11755E-4,6.7656400000000005E-4,6.3783999999999998E-4,5.4586800000000003E-4,4.8156799999999998E-4,3.9826E-4]
[null,null,null,520,4.24678E-4,4.8444800000000001E-4,5.6180599999999998E-4,6.2690900000000004E-4,6.8418400000000001E-4,7.2481900000000003E-4,7.5406500000000005E-4,7.7845900000000001E-4,7.9770600000000002E-4,8.0145699999999999E-4,7.7306800000000002E-4,7.7091099999999999E-4,7.66773E-4,7.3213100000000001E-4,6.7124199999999995E-4,6.1322099999999995E-4,5.8157499999999997E-4,4.8997099999999996E-4,4.1631600000000002E-4,4.0948900000000002E-4,4.8679000000000002E-4,5.5352400000000001E-4,6.3026100000000002E-4,6.7663700000000001E-4,6.9817999999999996E-4,7.5615600000000002E-4,7.6178200000000002E-4,7.8607000000000004E-4,7.9237999999999997E-4,7.9425199999999996E-4,7.5865999999999998E-4,7.2171900000000001E-4,6.7848099999999998E-4,6.2547799999999995E-4,5.6163100000000004E-4,4.9176000000000005E-4,3.8938800000000001E-4]
[null,null,null,521,4.12765E-4,5.0038600000000002E-4,5.6715800000000001E-4,6.45003E-4,6.9057099999999996E-4,7.2681099999999995E-4,7.7173300000000003E-4,7.6052400000000005E-4,7.8999099999999998E-4,7.9725599999999998E-4,7.9523799999999998E-4,7.8271600000000003E-4,7.6524999999999998E-4,7.3246800000000001E-4,6.8888399999999996E-4,6.0333700000000001E-4,5.7000300000000002E-4,5.0522200000000005E-4,4.3462500000000001E-4,4.0704899999999999E-4,5.0550699999999998E-4,5.53193E-4,6.25247E-4,6.6596799999999996E-4,7.2798700000000004E-4,7.6675099999999998E-4,7.7803799999999999E-4,7.7432800000000002E-4,7.9479699999999997E-4,7.9391800000000001E-4,7.5863500000000002E-4,7.4126200000000002E-4,7.1439599999999995E-4,6.1359800000000003E-4,5.5176400000000005E-4,4.9417899999999997E-4,4.1309199999999999E-4]
[null,null,null,522,4.4140800000000001E-4,5.5305700000000003E-4,6.1860799999999998E-4,6.5844000000000005E-4,7.3813899999999996E-4,7.6014599999999996E-4,7.9764699999999996E-4,8.3543099999999998E-4,8.4781400000000001E-4,8.3847399999999997E-4,8.6035199999999999E-4,8.2359299999999996E-4,8.2565600000000002E-4,8.0128100000000004E-4,7.6476199999999999E-4,6.8144600000000005E-4,6.23092E-4,5.4820300000000004E-4,4.5838399999999999E-4,4.6891499999999998E-4,5.5577600000000001E-4,6.4013999999999998E-4,6.7148000000000002E-4,7.65733E-4,7.6989500000000004E-4,8.0540099999999997E-4,8.4276700000000002E-4,8.6952999999999998E-4,8.7670800000000002E-4,8.7403999999999997E-4,8.1098100000000001E-4,8.2244100000000004E-4,7.7475299999999999E-4,7.2248099999999997E-4,6.2027299999999996E-4,5.6544199999999998E-4,4.7653799999999998E-4]
[null,null,null,523,4.29071E-4,5.1439300000000003E-4,5.76364E-4,6.3968399999999996E-4,7.0222700000000004E-4,7.9689599999999995E-4,8.0159100000000004E-4,7.8680299999999998E-4,8.2205699999999995E-4,8.14472E-4,8.2809300000000001E-4,8.0356299999999998E-4,7.6518500000000004E-4,7.5328099999999996E-4,7.0708800000000003E-4,6.7377799999999999E-4,5.9622099999999997E-4,5.2259599999999995E-4,4.5398699999999999E-4,4.6314499999999998E-4,5.2103200000000005E-4,5.7344399999999999E-4,6.4068199999999995E-4,6.8412599999999996E-4,7.5851900000000003E-4,7.5837300000000001E-4,7.8040399999999995E-4,7.9868599999999995E-4,8.30626E-4,8.3881199999999998E-4,7.9221900000000004E-4,7.8307400000000003E-4,7.0983400000000001E-4,6.3637999999999998E-4,5.8961500000000004E-4,4.7488199999999998E-4,4.1915700000000003E-4]
[null,null,null,524,4.5474900000000001E-4,5.2251100000000003E-4,5.9271200000000001E-4,6.5575400000000004E-4,7.20975E-4,7.8444099999999998E-4,8.0643900000000005E-4,8.1503299999999995E-4,8.37994E-4,8.4645399999999996E-4,8.3794800000000003E-4,8.3422599999999998E-4,8.0850799999999999E-4,7.7441499999999998E-4,7.1123400000000004E-4,6.8247499999999999E-4,5.9537399999999997E-4,5.5105499999999995E-4,4.5808900000000001E-4,4.6259699999999998E-4,5.4683100000000001E-4,6.0090000000000002E-4,6.8570600000000001E-4,7.2319300000000001E-4,7.5364900000000001E-4,8.0888900000000003E-4,8.4318399999999997E-4,8.2177300000000003E-4,8.4372099999999997E-4,8.5035199999999997E-4,7.8589600000000001E-4,7.8202299999999996E-4,7.3358400000000002E-4,6.5950100000000005E-4,6.1069800000000001E-4,5.3285699999999997E-4,4.66121E-4]
[null,null,null,525,4.2540399999999999E-4,5.0232599999999999E-4,5.77142E-4,6.4998699999999998E-4,7.2226400000000002E-4,7.7421300000000005E-4,7.9472600000000005E-4,8.0528299999999995E-4,8.3181599999999998E-4,8.4190100000000004E-4,8.4106999999999997E-4,8.1415100000000005E-4,8.0924999999999997E-4,7.8558899999999995E-4,7.06466E-4,6.52343E-4,5.7457299999999999E-4,5.3028999999999999E-4,4.5762500000000002E-4,4.3649299999999998E-4,5.4772000000000002E-4,6.1337000000000002E-4,6.7434000000000005E-4,7.3152700000000005E-4,7.6188299999999998E-4,7.9484100000000002E-4,8.1893700000000005E-4,8.1943399999999996E-4,8.4005699999999996E-4,8.39302E-4,8.1736600000000003E-4,7.7649200000000005E-4,7.2416799999999997E-4,6.4630899999999997E-4,5.9703000000000002E-4,5.2467400000000004E-4,4.2429700000000002E-4]
[null,null,null,526,4.3511599999999999E-4,5.0910899999999999E-4,5.9299199999999998E-4,6.8211699999999999E-4,7.1995399999999997E-4,7.8992899999999998E-4,8.1736199999999997E-4,8.15236E-4,8.4431000000000003E-4,8.4260599999999998E-4,8.6469900000000002E-4,8.4278E-4,8.0707399999999996E-4,8.1128799999999996E-4,7.2358800000000005E-4,6.5761499999999996E-4,5.6780199999999996E-4,5.4385700000000002E-4,4.7730800000000002E-4,4.4267500000000001E-4,5.4154699999999997E-4,6.2264799999999995E-4,6.6386600000000004E-4,7.5303299999999996E-4,7.7839499999999998E-4,8.1094399999999997E-4,8.0766900000000001E-4,8.4886399999999996E-4,8.4011199999999996E-4,8.3872600000000003E-4,8.2071499999999996E-4,7.7580499999999996E-4,7.2698900000000004E-4,6.6704600000000002E-4,6.1814900000000002E-4,5.2737499999999996E-4,4.3297600000000001E-4]
[null,null,null,527,4.7584800000000002E-4,5.3573300000000004E-4,6.1538499999999998E-4,7.0483799999999995E-4,7.4877400000000001E-4,8.0790400000000002E-4,8.3884200000000002E-4,8.5254899999999997E-4,8.8101200000000003E-4,8.58927E-4,8.8643399999999996E-4,8.8590000000000001E-4,8.2930600000000003E-4,8.10884E-4,7.8463800000000005E-4,6.9072100000000004E-4,6.3287900000000004E-4,5.6762800000000003E-4,4.7114200000000002E-4,4.8663500000000002E-4,5.73995E-4,6.4684599999999997E-4,6.9349600000000004E-4,7.6644699999999996E-4,7.6536900000000001E-4,8.1633499999999996E-4,8.3614599999999996E-4,8.8003799999999998E-4,8.7230700000000001E-4,8.7164199999999995E-4,8.5741599999999995E-4,8.1421599999999998E-4,7.7356300000000001E-4,6.9169499999999998E-4,6.4216100000000003E-4,5.5528000000000001E-4,4.794E-4]
[null,null,null,528,4.77169E-4,5.6181000000000004E-4,6.33028E-4,7.0706899999999995E-4,7.8987600000000001E-4,8.3792800000000005E-4,8.6329500000000003E-4,8.6246000000000001E-4,8.9931199999999998E-4,9.0830200000000005E-4,9.1598799999999996E-4,8.9298999999999997E-4,8.7444699999999998E-4,8.3703800000000002E-4,7.6833700000000001E-4,7.5434099999999995E-4,6.6069800000000004E-4,5.6748499999999995E-4,4.9182000000000002E-4,5.0671600000000005E-4,5.8690599999999999E-4,6.6148900000000002E-4,7.2467600000000005E-4,7.88691E-4,8.3398999999999995E-4,8.6631399999999997E-4,8.5336299999999999E-4,8.9442099999999995E-4,9.24887E-4,9.0442300000000001E-4,8.8992200000000002E-4,8.4101800000000002E-4,8.1646099999999999E-4,7.1814399999999999E-4,6.4263099999999995E-4,5.8362099999999999E-4,5.2051599999999995E-4]
[null,null,null,529,4.5338900000000001E-4,5.3169399999999998E-4,6.1410299999999996E-4,6.8095999999999999E-4,7.2825699999999995E-4,7.8343900000000003E-4,8.3412299999999998E-4,8.4731800000000001E-4,8.62143E-4,8.5806700000000001E-4,8.4243399999999998E-4,8.7882800000000001E-4,8.5849400000000001E-4,8.3675700000000004E-4,7.5389700000000001E-4,6.9237499999999996E-4,6.2473499999999996E-4,5.3547000000000002E-4,4.7224799999999998E-4,4.7147299999999998E-4,5.39015E-4,6.1259599999999997E-4,6.90553E-4,7.4904099999999999E-4,7.4759900000000005E-4,8.35832E-4,8.3347900000000003E-4,8.4924800000000004E-4,8.82608E-4,8.4154200000000003E-4,8.1747999999999999E-4,8.1554499999999999E-4,7.4479600000000004E-4,7.0970799999999998E-4,6.2439699999999995E-4,5.4675899999999996E-4,4.3766699999999998E-4]
[null,null,null,530,4.38811E-4,5.1644500000000003E-4,6.1226800000000001E-4,6.6484699999999999E-4,7.3028999999999998E-4,8.0508000000000001E-4,8.2802799999999997E-4,8.2761399999999995E-4,8.7229600000000005E-4,8.6947200000000004E-4,8.6125600000000002E-4,8.6782700000000005E-4,8.4864100000000002E-4,8.1052399999999997E-4,7.4926099999999998E-4,6.9286900000000004E-4,6.1111800000000001E-4,5.2654999999999998E-4,4.6631400000000001E-4,4.43545E-4,5.3665699999999995E-4,5.8931999999999995E-4,6.8361699999999997E-4,7.3167499999999999E-4,7.96782E-4,7.9477300000000003E-4,8.4845500000000002E-4,8.6292200000000002E-4,8.6694699999999997E-4,8.5591400000000005E-4,8.5274199999999997E-4,8.1189299999999995E-4,7.3074100000000003E-4,6.7498500000000002E-4,6.2167400000000001E-4,5.3572099999999996E-4,4.43397E-4]
[null,null,null,531,4.8317999999999999E-4,5.7979099999999997E-4,6.3334199999999995E-4,7.2904100000000004E-4,7.8634799999999997E-4,8.4857599999999997E-4,8.8328600000000005E-4,8.9422799999999995E-4,8.9955500000000002E-4,9.1221800000000001E-4,9.2521400000000005E-4,8.9389099999999996E-4,8.9014900000000002E-4,8.4857699999999999E-4,7.99929E-4,7.52843E-4,6.5306200000000004E-4,5.6979899999999996E-4,5.0924499999999997E-4,4.9930000000000005E-4,5.9370600000000005E-4,6.2278400000000003E-4,7.3086400000000001E-4,7.6057200000000005E-4,8.2359399999999998E-4,8.7109500000000001E-4,8.9441399999999995E-4,9.0977699999999996E-4,8.9461200000000003E-4,8.8491600000000002E-4,8.8482199999999995E-4,8.4095600000000002E-4,7.8858599999999997E-4,7.2386399999999995E-4,6.50711E-4,5.70043E-4,4.8049200000000001E-4]
[null,null,null,532,5.0365499999999999E-4,5.62172E-4,6.39604E-4,7.4509200000000004E-4,8.1108000000000005E-4,8.4482000000000003E-4,8.6832200000000004E-4,9.2537800000000003E-4,9.0742399999999999E-4,9.3386499999999998E-4,9.4186699999999999E-4,9.14345E-4,8.90554E-4,8.6870199999999995E-4,8.0550499999999998E-4,7.3743099999999998E-4,6.5181400000000002E-4,5.9208600000000002E-4,5.0553399999999997E-4,5.3910000000000004E-4,6.0327199999999997E-4,6.3363500000000001E-4,7.3277599999999998E-4,7.9248399999999998E-4,8.4293499999999995E-4,8.9551099999999998E-4,9.1036000000000003E-4,8.9949300000000002E-4,9.2071700000000004E-4,9.0898599999999997E-4,8.9802000000000002E-4,8.5165800000000004E-4,7.9074099999999997E-4,7.33349E-4,6.5889300000000002E-4,5.9179100000000004E-4,4.9353099999999996E-4]
[null,null,null,533,4.8961899999999995E-4,5.8578500000000002E-4,6.90787E-4,7.7511300000000002E-4,8.0489400000000001E-4,8.8520700000000005E-4,9.0445200000000003E-4,9.4346100000000004E-4,9.1894299999999997E-4,9.3828399999999995E-4,9.2247200000000003E-4,9.0085899999999995E-4,8.88151E-4,8.5606899999999999E-4,7.8995400000000005E-4,7.5065600000000004E-4,6.5959099999999995E-4,6.0293100000000002E-4,5.33678E-4,5.1696200000000004E-4,6.0376799999999997E-4,6.7508100000000001E-4,7.5827299999999995E-4,8.2176999999999999E-4,8.5546899999999998E-4,8.9738100000000005E-4,9.1961400000000002E-4,9.24763E-4,9.2484900000000005E-4,9.2671500000000005E-4,9.3142300000000002E-4,8.7133200000000005E-4,8.4902299999999997E-4,7.7203999999999999E-4,7.0390100000000005E-4,5.9383400000000001E-4,5.19741E-4]
[null,null,null,534,4.9960599999999999E-4,5.4961599999999995E-4,6.6346099999999996E-4,7.3307500000000002E-4,8.1711800000000003E-4,8.3507700000000004E-4,8.89769E-4,9.0224999999999995E-4,9.3511500000000003E-4,9.3283000000000005E-4,9.2671300000000002E-4,9.1478000000000002E-4,9.1015599999999996E-4,8.4677299999999999E-4,8.0406499999999997E-4,7.3176399999999998E-4,6.5729099999999995E-4,5.8058299999999997E-4,4.8788199999999997E-4,5.02182E-4,5.8563500000000004E-4,6.5143799999999995E-4,7.33996E-4,8.0768099999999998E-4,8.3296399999999995E-4,8.7498199999999995E-4,8.8172100000000002E-4,9.05841E-4,9.1347499999999996E-4,9.3238200000000005E-4,8.8915200000000004E-4,8.64959E-4,8.1546699999999995E-4,7.3815199999999995E-4,6.5006600000000003E-4,5.4585600000000005E-4,4.8187499999999999E-4]
[null,null,null,535,4.8660000000000001E-4,5.9287900000000004E-4,6.4101000000000002E-4,7.4156999999999999E-4,8.1871099999999996E-4,8.6647199999999997E-4,9.0603000000000005E-4,9.02026E-4,9.4642800000000003E-4,9.6217700000000004E-4,9.3515000000000004E-4,9.3811999999999997E-4,9.0966899999999999E-4,8.7055399999999995E-4,8.1282299999999995E-4,7.3009500000000005E-4,6.5083199999999995E-4,5.7362400000000001E-4,4.9510999999999999E-4,5.08586E-4,5.8622100000000005E-4,6.5274899999999999E-4,7.40841E-4,7.8989200000000005E-4,8.4342200000000003E-4,8.9309600000000002E-4,9.1912799999999996E-4,9.3017999999999996E-4,9.4203099999999997E-4,9.3935500000000001E-4,9.0370700000000001E-4,8.6606499999999996E-4,8.1392699999999999E-4,7.4177399999999995E-4,6.8991099999999997E-4,5.6922600000000004E-4,4.8565000000000001E-4]
[null,null,null,536,5.3276400000000002E-4,6.21453E-4,7.0441600000000003E-4,7.8153900000000004E-4,8.6691299999999997E-4,8.9703899999999997E-4,9.4447200000000002E-4,9.6030499999999995E-4,9.99055E-4,1.0101299999999999E-3,1.0142700000000001E-3,9.5814399999999997E-4,9.3658200000000004E-4,9.2633400000000001E-4,8.56407E-4,7.7706900000000002E-4,7.2522299999999999E-4,6.2540100000000004E-4,5.4087500000000001E-4,5.7034700000000002E-4,6.36161E-4,7.0772900000000004E-4,7.87107E-4,8.4937999999999995E-4,8.90802E-4,9.525E-4,9.5679300000000005E-4,9.8181599999999994E-4,9.9903899999999996E-4,9.7933000000000004E-4,9.3699899999999999E-4,9.0171200000000004E-4,8.5111900000000001E-4,8.07207E-4,7.1604899999999996E-4,6.1847099999999999E-4,5.3430000000000003E-4]
[null,null,null,537,5.1496400000000003E-4,6.1970199999999997E-4,7.0585500000000002E-4,8.0703399999999998E-4,8.82057E-4,9.1013300000000004E-4,9.5048699999999997E-4,1.0053499999999999E-3,1.0009000000000001E-3,9.8391499999999992E-4,1.0053900000000001E-3,9.8028200000000007E-4,9.4617300000000002E-4,9.5032899999999997E-4,8.6475899999999999E-4,7.8228499999999997E-4,7.3368200000000004E-4,6.2691699999999995E-4,5.4986300000000004E-4,5.2577699999999995E-4,6.3916600000000004E-4,6.9066600000000004E-4,7.7549200000000002E-4,8.5859499999999997E-4,8.8753599999999997E-4,9.5958600000000001E-4,9.7500099999999997E-4,9.6009999999999997E-4,1.00811E-3,9.893949999999999E-4,9.4861499999999998E-4,9.1993000000000001E-4,8.5956100000000001E-4,7.9130699999999999E-4,7.0219399999999995E-4,6.2091399999999997E-4,5.25615E-4]
[null,null,null,538,5.04833E-4,6.0124199999999999E-4,6.9531400000000004E-4,7.3807899999999999E-4,8.2909800000000001E-4,8.9844600000000001E-4,9.3675099999999999E-4,9.5923899999999997E-4,9.84478E-4,9.6671300000000001E-4,9.8665100000000006E-4,9.6984199999999995E-4,9.2813200000000002E-4,8.9045599999999997E-4,8.4280399999999995E-4,7.8922300000000003E-4,6.9712300000000001E-4,5.9866699999999999E-4,5.3325099999999999E-4,5.1891600000000002E-4,6.28931E-4,6.8758800000000004E-4,7.92251E-4,8.4141000000000001E-4,8.6599599999999995E-4,9.4359700000000001E-4,9.6814600000000002E-4,9.5456499999999999E-4,1.00179E-3,9.9648800000000002E-4,9.5647500000000003E-4,9.0014200000000004E-4,8.45493E-4,7.6214900000000005E-4,6.9658299999999997E-4,6.1087800000000003E-4,5.2901700000000001E-4]
[null,null,null,539,4.9843399999999996E-4,6.0335100000000002E-4,6.6583699999999996E-4,7.6232700000000003E-4,8.4718100000000002E-4,8.8580600000000005E-4,9.0697200000000003E-4,9.6683100000000003E-4,9.4946400000000002E-4,9.9548200000000001E-4,9.7984000000000005E-4,9.4286200000000004E-4,9.3026899999999995E-4,9.0525200000000005E-4,8.2593800000000002E-4,7.6013000000000003E-4,6.6930099999999997E-4,5.9495499999999998E-4,5.0259199999999995E-4,5.0038999999999997E-4,6.0879300000000005E-4,6.8817200000000002E-4,7.5602199999999997E-4,8.0475800000000004E-4,8.59223E-4,9.33116E-4,9.4176399999999999E-4,9.4729199999999997E-4,9.5545799999999996E-4,9.5014399999999999E-4,9.3669200000000004E-4,8.9031899999999998E-4,8.3283499999999998E-4,7.5808099999999997E-4,6.6454899999999996E-4,5.8019699999999996E-4,5.0719600000000001E-4]
[null,null,null,540,5.10941E-4,6.0819400000000005E-4,7.0438E-4,7.8979600000000005E-4,8.6164399999999995E-4,8.93384E-4,9.5365700000000001E-4,9.8079000000000005E-4,1.0013400000000001E-3,9.8569200000000004E-4,9.8628299999999991E-4,9.4865900000000003E-4,9.5597900000000003E-4,9.1958199999999995E-4,8.6838300000000002E-4,7.8491599999999998E-4,7.0750399999999997E-4,6.1310800000000001E-4,5.0150100000000001E-4,5.3003800000000004E-4,6.2527899999999996E-4,6.8914499999999995E-4,7.6029099999999996E-4,8.5589300000000004E-4,9.1058800000000004E-4,9.4717E-4,9.7635899999999999E-4,9.7858100000000007E-4,9.8500200000000001E-4,9.9606299999999994E-4,9.5299600000000001E-4,9.2045199999999999E-4,8.7166299999999995E-4,7.9572300000000002E-4,6.94044E-4,5.9814299999999998E-4,5.2574399999999997E-4]
[null,null,null,541,5.0816100000000003E-4,5.9623300000000005E-4,6.7620899999999999E-4,7.6069099999999997E-4,8.4160500000000004E-4,9.1318300000000003E-4,9.3712999999999999E-4,9.5965299999999998E-4,9.5710599999999999E-4,9.8880499999999994E-4,9.6860200000000005E-4,9.5884300000000002E-4,9.3256899999999995E-4,8.8605499999999996E-4,8.4720300000000004E-4,7.5718900000000002E-4,6.9887699999999998E-4,5.8281200000000004E-4,4.9727799999999998E-4,5.0880700000000001E-4,6.1172199999999998E-4,6.7515299999999995E-4,7.5875499999999995E-4,8.3713199999999998E-4,8.8775799999999999E-4,9.3061700000000001E-4,9.56783E-4,9.8571500000000007E-4,9.7770400000000003E-4,9.7070999999999995E-4,9.3522199999999998E-4,8.9282599999999999E-4,8.4702499999999995E-4,7.9233899999999998E-4,6.7459699999999998E-4,5.6125200000000004E-4,5.0632499999999996E-4]
[null,null,null,542,5.1576900000000001E-4,6.2026699999999998E-4,7.1372899999999997E-4,7.8989399999999997E-4,8.7571399999999998E-4,9.4225699999999995E-4,9.8522200000000001E-4,9.8185099999999995E-4,1.01005E-3,1.0473800000000001E-3,1.0217099999999999E-3,1.00402E-3,1.00099E-3,9.2519399999999995E-4,8.9627900000000004E-4,8.0290899999999998E-4,7.2256800000000004E-4,6.2292100000000002E-4,5.5159600000000001E-4,5.4919799999999998E-4,6.31093E-4,7.1891499999999998E-4,7.8856399999999995E-4,8.7995499999999997E-4,9.3534100000000002E-4,9.7380199999999996E-4,9.7669199999999992E-4,1.0481500000000001E-3,1.0386900000000001E-3,9.8975800000000009E-4,9.5787400000000005E-4,9.2288500000000002E-4,8.6670400000000004E-4,8.1130199999999997E-4,7.3036900000000003E-4,6.1908500000000001E-4,5.2499399999999998E-4]
[null,null,null,543,5.3327300000000002E-4,6.1653999999999995E-4,6.9099899999999998E-4,8.0489299999999999E-4,8.4965699999999997E-4,9.2928300000000004E-4,9.8149200000000004E-4,9.9123000000000006E-4,1.02082E-3,1.01991E-3,1.0032800000000001E-3,1.0041900000000001E-3,9.8482400000000003E-4,9.3360899999999996E-4,8.8909000000000004E-4,8.11607E-4,7.0914199999999995E-4,6.3630999999999996E-4,5.4226399999999998E-4,5.7062699999999998E-4,6.4592499999999999E-4,7.0842799999999999E-4,7.8512199999999997E-4,8.6781599999999999E-4,9.10007E-4,9.42818E-4,9.4629200000000005E-4,1.00219E-3,1.0350800000000001E-3,1.0000199999999999E-3,9.8586700000000008E-4,9.28523E-4,8.7888899999999999E-4,8.0341899999999999E-4,7.3457199999999996E-4,6.3475999999999995E-4,5.2857399999999997E-4]
[null,null,null,544,5.5647499999999996E-4,6.5796799999999999E-4,7.4660899999999997E-4,8.2974399999999999E-4,9.1543099999999997E-4,9.8415200000000007E-4,1.0320399999999999E-3,1.05948E-3,1.0680100000000001E-3,1.09297E-3,1.0354299999999999E-3,1.0543600000000001E-3,1.01194E-3,9.7188899999999998E-4,9.2880600000000001E-4,8.3215199999999996E-4,7.6365899999999997E-4,6.58699E-4,5.8097200000000002E-4,5.5835300000000004E-4,6.8177099999999996E-4,7.4797000000000004E-4,8.4099299999999995E-4,9.0325900000000001E-4,9.7795999999999994E-4,9.9195100000000003E-4,1.03494E-3,1.0460999999999999E-3,1.07317E-3,1.0628300000000001E-3,1.01286E-3,9.7754299999999999E-4,9.2927000000000005E-4,8.2220700000000004E-4,7.7400400000000001E-4,6.7372500000000002E-4,5.6497600000000002E-4]
[null,null,null,545,5.4213500000000001E-4,6.5015199999999998E-4,7.4253899999999996E-4,8.26164E-4,9.2470300000000003E-4,9.7012200000000002E-4,9.988480000000001E-4,1.01921E-3,1.04386E-3,1.0684399999999999E-3,1.0665799999999999E-3,1.0565800000000001E-3,1.0044800000000001E-3,9.7660900000000003E-4,8.9329199999999996E-4,8.3631199999999997E-4,7.4381399999999998E-4,6.6486599999999996E-4,5.6722800000000002E-4,5.8185099999999998E-4,6.6826400000000001E-4,7.6590200000000005E-4,8.3041899999999999E-4,8.9615799999999998E-4,9.5564599999999999E-4,9.9043999999999998E-4,1.0186500000000001E-3,1.05032E-3,1.0634100000000001E-3,1.0548199999999999E-3,1.01866E-3,9.8231899999999994E-4,9.4549300000000005E-4,8.3181499999999996E-4,7.20348E-4,6.3338299999999995E-4,5.4324400000000002E-4]
[null,null,null,546,5.6797800000000002E-4,6.4097399999999999E-4,7.6898899999999998E-4,8.4457100000000002E-4,9.1696099999999999E-4,9.7118699999999998E-4,1.0149600000000001E-3,1.03506E-3,1.08738E-3,1.0896600000000001E-3,1.0765600000000001E-3,1.07211E-3,1.0121399999999999E-3,1.00906E-3,9.24763E-4,8.3797500000000003E-4,7.8112600000000004E-4,6.6019899999999999E-4,5.3972099999999995E-4,5.6558800000000001E-4,6.8007300000000001E-4,7.7710099999999999E-4,8.4128000000000002E-4,9.0697399999999995E-4,9.8786199999999994E-4,1.0337899999999999E-3,1.05937E-3,1.0581E-3,1.0747199999999999E-3,1.06832E-3,1.0069E-3,1.0228399999999999E-3,9.2721600000000002E-4,8.3502200000000004E-4,7.4288100000000003E-4,6.6064699999999999E-4,5.3924599999999995E-4]
[null,null,null,547,5.7446099999999996E-4,6.6871400000000005E-4,7.6838899999999996E-4,8.6910299999999998E-4,9.3431600000000003E-4,1.00012E-3,1.0391199999999999E-3,1.0704600000000001E-3,1.1038199999999999E-3,1.0849500000000001E-3,1.0827300000000001E-3,1.06883E-3,1.04086E-3,1.0045099999999999E-3,9.5211199999999997E-4,8.6918100000000001E-4,7.7966199999999998E-4,6.7704899999999999E-4,5.5862900000000005E-4,5.8390999999999998E-4,6.7995299999999996E-4,7.61085E-4,8.76059E-4,9.3002700000000005E-4,9.8297899999999993E-4,1.04637E-3,1.0690400000000001E-3,1.08384E-3,1.08573E-3,1.09125E-3,1.0443500000000001E-3,1.01406E-3,9.2726899999999999E-4,8.6162800000000002E-4,7.7504199999999998E-4,6.6642299999999997E-4,5.7803200000000002E-4]
[null,null,null,548,5.9094599999999996E-4,6.9374599999999997E-4,7.7496100000000001E-4,8.70695E-4,9.6613700000000005E-4,1.0465299999999999E-3,1.08797E-3,1.0889999999999999E-3,1.1162699999999999E-3,1.11728E-3,1.1328600000000001E-3,1.10348E-3,1.0673200000000001E-3,1.0385399999999999E-3,9.6127799999999998E-4,9.0575300000000003E-4,8.0512300000000004E-4,7.0256300000000002E-4,5.9371999999999995E-4,5.9398700000000003E-4,7.01054E-4,7.9322099999999999E-4,8.9915399999999999E-4,9.2640699999999997E-4,1.0489900000000001E-3,1.05915E-3,1.0893400000000001E-3,1.1038599999999999E-3,1.1310599999999999E-3,1.12199E-3,1.0617999999999999E-3,1.0395199999999999E-3,9.7821299999999991E-4,8.6248900000000003E-4,7.8556299999999997E-4,6.8646400000000002E-4,5.8437300000000001E-4]
[null,null,null,549,6.2185400000000003E-4,7.2121700000000002E-4,8.2630099999999999E-4,8.9346399999999996E-4,9.74927E-4,1.0602599999999999E-3,1.0914099999999999E-3,1.11571E-3,1.1589E-3,1.14244E-3,1.15007E-3,1.13109E-3,1.10739E-3,1.0586199999999999E-3,9.957080000000001E-4,9.2172200000000004E-4,8.2641400000000003E-4,7.2806200000000002E-4,6.3360999999999995E-4,6.4849899999999997E-4,7.3127200000000004E-4,8.2224800000000003E-4,9.14937E-4,9.9518299999999996E-4,1.0363499999999999E-3,1.0819600000000001E-3,1.1508099999999999E-3,1.16186E-3,1.13579E-3,1.1631300000000001E-3,1.1087499999999999E-3,1.0596399999999999E-3,1.0044100000000001E-3,9.3241099999999996E-4,8.2065299999999996E-4,7.1388699999999996E-4,6.2375600000000005E-4]
[null,null,null,550,5.8907999999999996E-4,7.0108699999999998E-4,8.0941499999999996E-4,8.8323000000000004E-4,9.6996400000000003E-4,1.04053E-3,1.0830900000000001E-3,1.1103599999999999E-3,1.14532E-3,1.1691200000000001E-3,1.1224E-3,1.0959699999999999E-3,1.09877E-3,1.0399599999999999E-3,9.6019400000000004E-4,8.9992900000000005E-4,8.26267E-4,6.9580300000000005E-4,6.0787299999999999E-4,6.0786599999999998E-4,7.1409499999999999E-4,7.8851400000000003E-4,8.8992900000000002E-4,9.6549099999999996E-4,1.0198900000000001E-3,1.0799900000000001E-3,1.0811200000000001E-3,1.1599900000000001E-3,1.14252E-3,1.1146000000000001E-3,1.1056600000000001E-3,1.05821E-3,1.0080499999999999E-3,8.9604400000000003E-4,8.2301300000000004E-4,7.1994500000000005E-4,5.8414100000000004E-4]
[null,null,null,551,5.9956699999999996E-4,6.7466300000000004E-4,8.1089300000000003E-4,8.9658800000000003E-4,9.8744999999999996E-4,1.0591999999999999E-3,1.0837500000000001E-3,1.13802E-3,1.16026E-3,1.1704899999999999E-3,1.1434100000000001E-3,1.1115000000000001E-3,1.1016000000000001E-3,1.05693E-3,9.8382000000000005E-4,9.1171199999999996E-4,8.3082399999999997E-4,6.9643299999999999E-4,6.0736899999999996E-4,6.0594299999999995E-4,7.2071500000000003E-4,8.1406299999999996E-4,9.0663600000000005E-4,9.8288200000000003E-4,1.0456899999999999E-3,1.1016299999999999E-3,1.11783E-3,1.14375E-3,1.14324E-3,1.1319100000000001E-3,1.12502E-3,1.06493E-3,9.8616700000000003E-4,9.0519799999999996E-4,8.0162099999999997E-4,6.9492700000000002E-4,5.9174200000000003E-4]
[null,null,null,552,5.9892799999999998E-4,6.8439900000000003E-4,7.9344699999999997E-4,8.9040199999999999E-4,1.0011600000000001E-3,1.0428600000000001E-3,1.0741100000000001E-3,1.1262100000000001E-3,1.15128E-3,1.1622E-3,1.14674E-3,1.11881E-3,1.0788099999999999E-3,1.0550900000000001E-3,9.7938499999999993E-4,9.2143699999999999E-4,8.1013700000000005E-4,7.0009200000000003E-4,6.06965E-4,6.00382E-4,7.0439500000000002E-4,7.8552400000000001E-4,9.0260600000000002E-4,9.7391600000000002E-4,1.0450800000000001E-3,1.0988300000000001E-3,1.11651E-3,1.1420099999999999E-3,1.1699200000000001E-3,1.1604899999999999E-3,1.10216E-3,1.0664699999999999E-3,1.00917E-3,8.9701799999999997E-4,7.8576399999999999E-4,6.8889699999999995E-4,5.9152800000000002E-4]
[null,null,null,553,6.6430600000000003E-4,7.1770299999999998E-4,8.3794499999999999E-4,9.57788E-4,1.0292700000000001E-3,1.10866E-3,1.1498599999999999E-3,1.1943800000000001E-3,1.2029199999999999E-3,1.2060300000000001E-3,1.20543E-3,1.19034E-3,1.1457100000000001E-3,1.08486E-3,1.0244399999999999E-3,9.6098500000000003E-4,8.8876299999999999E-4,7.5771200000000001E-4,6.4055700000000004E-4,6.48053E-4,7.6401099999999999E-4,8.5888700000000002E-4,9.7026100000000004E-4,1.0291300000000001E-3,1.0884899999999999E-3,1.1511799999999999E-3,1.1959099999999999E-3,1.2087199999999999E-3,1.2354899999999999E-3,1.2064000000000001E-3,1.1702100000000001E-3,1.11282E-3,1.0512500000000001E-3,9.5476000000000003E-4,8.5339400000000005E-4,7.6043300000000003E-4,6.1012100000000004E-4]
[null,null,null,554,6.5819700000000001E-4,7.6369700000000003E-4,8.49962E-4,9.8029499999999995E-4,1.04769E-3,1.12078E-3,1.1770800000000001E-3,1.2304E-3,1.2061299999999999E-3,1.23526E-3,1.2276100000000001E-3,1.2255300000000001E-3,1.16333E-3,1.1040100000000001E-3,1.07537E-3,9.7249000000000001E-4,8.78531E-4,7.4715199999999995E-4,6.5744900000000005E-4,6.7564100000000005E-4,7.6743099999999995E-4,8.5674299999999998E-4,9.7151400000000004E-4,1.0593899999999999E-3,1.1362200000000001E-3,1.1971E-3,1.21962E-3,1.21317E-3,1.2235799999999999E-3,1.2169500000000001E-3,1.19053E-3,1.1569600000000001E-3,1.0452199999999999E-3,9.7586799999999996E-4,8.7297000000000004E-4,7.4342799999999997E-4,6.3729100000000001E-4]
[null,null,null,555,6.5346999999999996E-4,7.9047999999999998E-4,8.98962E-4,9.996479999999999E-4,1.0846199999999999E-3,1.1518699999999999E-3,1.2046699999999999E-3,1.2421299999999999E-3,1.24095E-3,1.24522E-3,1.28265E-3,1.22758E-3,1.19144E-3,1.14361E-3,1.0788200000000001E-3,9.9443800000000005E-4,8.7625099999999998E-4,7.6384800000000002E-4,6.7080099999999995E-4,6.8739099999999998E-4,7.8496000000000002E-4,9.0211999999999996E-4,1.00033E-3,1.05978E-3,1.1694400000000001E-3,1.1945E-3,1.2348700000000001E-3,1.2338399999999999E-3,1.25578E-3,1.2752799999999999E-3,1.23398E-3,1.15872E-3,1.1051800000000001E-3,9.9807900000000002E-4,9.0724600000000001E-4,7.7052700000000002E-4,6.43006E-4]
[null,null,null,556,6.6642399999999999E-4,7.7984799999999998E-4,8.9062899999999999E-4,1.0009999999999999E-3,1.0913800000000001E-3,1.16306E-3,1.20681E-3,1.2525100000000001E-3,1.30091E-3,1.2639999999999999E-3,1.28717E-3,1.26734E-3,1.2101900000000001E-3,1.18114E-3,1.0964099999999999E-3,1.0265700000000001E-3,9.0715399999999997E-4,7.8317600000000001E-4,6.8523100000000001E-4,6.9350499999999997E-4,7.9410199999999998E-4,9.0536800000000004E-4,1.0025500000000001E-3,1.09425E-3,1.17074E-3,1.2097200000000001E-3,1.2478000000000001E-3,1.28564E-3,1.28291E-3,1.2824399999999999E-3,1.2294000000000001E-3,1.1901399999999999E-3,1.12202E-3,1.0223000000000001E-3,8.8817900000000001E-4,7.7657400000000004E-4,6.6089999999999996E-4]
[null,null,null,557,6.56151E-4,7.5311900000000001E-4,8.8507099999999997E-4,9.960730000000001E-4,1.07325E-3,1.1620300000000001E-3,1.20243E-3,1.2447599999999999E-3,1.2659100000000001E-3,1.2847799999999999E-3,1.2627199999999999E-3,1.2492499999999999E-3,1.2071300000000001E-3,1.1754000000000001E-3,1.0902399999999999E-3,1.02198E-3,9.0376599999999997E-4,7.7952299999999996E-4,6.7478099999999995E-4,6.5937099999999996E-4,7.9540899999999996E-4,9.0996299999999996E-4,1.0121799999999999E-3,1.09066E-3,1.12999E-3,1.2284100000000001E-3,1.2384E-3,1.28959E-3,1.2679499999999999E-3,1.26454E-3,1.2282700000000001E-3,1.1736299999999999E-3,1.12576E-3,1.01015E-3,8.9636999999999996E-4,7.8257999999999995E-4,6.2753199999999998E-4]
[null,null,null,558,7.3128799999999997E-4,8.3239100000000003E-4,9.4423599999999999E-4,1.02776E-3,1.14047E-3,1.2379100000000001E-3,1.2828399999999999E-3,1.2941700000000001E-3,1.3464900000000001E-3,1.33836E-3,1.3364500000000001E-3,1.3170499999999999E-3,1.27749E-3,1.2326100000000001E-3,1.1331100000000001E-3,1.0554200000000001E-3,9.4330900000000003E-4,8.3694399999999995E-4,7.3283599999999995E-4,7.2342700000000001E-4,8.5968700000000004E-4,9.3430399999999995E-4,1.05204E-3,1.1545500000000001E-3,1.20717E-3,1.2625399999999999E-3,1.3241399999999999E-3,1.3494900000000001E-3,1.358E-3,1.30707E-3,1.3079000000000001E-3,1.24033E-3,1.17768E-3,1.0549000000000001E-3,9.4099600000000004E-4,8.3672200000000003E-4,7.0660000000000004E-4]
[null,null,null,559,6.8630500000000001E-4,8.0176300000000004E-4,9.1350100000000005E-4,1.0292999999999999E-3,1.13613E-3,1.20823E-3,1.2460100000000001E-3,1.3186700000000001E-3,1.3290800000000001E-3,1.31405E-3,1.31701E-3,1.2886E-3,1.24288E-3,1.2003700000000001E-3,1.13816E-3,1.0504799999999999E-3,9.6840800000000003E-4,8.0504899999999996E-4,7.1502200000000005E-4,7.2150600000000001E-4,8.1709600000000001E-4,9.5701499999999997E-4,1.04633E-3,1.14164E-3,1.1853300000000001E-3,1.2911699999999999E-3,1.31595E-3,1.3182700000000001E-3,1.3341099999999999E-3,1.31467E-3,1.28545E-3,1.24175E-3,1.1559999999999999E-3,1.05244E-3,9.3503399999999995E-4,8.5614899999999995E-4,6.8129499999999995E-4]
[null,null,null,560,7.0498200000000005E-4,8.1170400000000001E-4,9.4806100000000004E-4,1.0563700000000001E-3,1.1599100000000001E-3,1.23171E-3,1.28118E-3,1.3295E-3,1.33512E-3,1.33756E-3,1.3367800000000001E-3,1.3132599999999999E-3,1.2869100000000001E-3,1.26027E-3,1.1578000000000001E-3,1.0689199999999999E-3,9.4986400000000003E-4,8.1926899999999997E-4,7.16809E-4,7.2097000000000003E-4,8.2167700000000004E-4,9.6470300000000002E-4,1.0712300000000001E-3,1.13908E-3,1.2187000000000001E-3,1.2746000000000001E-3,1.33212E-3,1.34253E-3,1.36213E-3,1.3147300000000001E-3,1.2757300000000001E-3,1.2732100000000001E-3,1.17713E-3,1.0682700000000001E-3,9.5815400000000002E-4,8.1585999999999996E-4,6.8528700000000003E-4]
[null,null,null,561,7.4908699999999995E-4,8.67686E-4,9.8854200000000002E-4,1.09906E-3,1.2237699999999999E-3,1.2768300000000001E-3,1.3441600000000001E-3,1.37257E-3,1.3890599999999999E-3,1.3988900000000001E-3,1.4043899999999999E-3,1.34712E-3,1.33446E-3,1.3048300000000001E-3,1.2040200000000001E-3,1.10987E-3,1.00274E-3,8.6779399999999997E-4,7.74609E-4,7.6033800000000005E-4,8.9657099999999998E-4,1.0051299999999999E-3,1.1173000000000001E-3,1.1925200000000001E-3,1.28028E-3,1.33175E-3,1.36842E-3,1.3926399999999999E-3,1.38091E-3,1.3868000000000001E-3,1.3622700000000001E-3,1.2996100000000001E-3,1.2072299999999999E-3,1.1140099999999999E-3,9.8246100000000001E-4,8.6876E-4,7.4506599999999996E-4]
[null,null,null,562,7.2436199999999999E-4,8.6070099999999996E-4,9.8285800000000008E-4,1.08654E-3,1.2051900000000001E-3,1.2846800000000001E-3,1.3527400000000001E-3,1.4023099999999999E-3,1.3988799999999999E-3,1.41584E-3,1.38126E-3,1.3892799999999999E-3,1.3337799999999999E-3,1.2961800000000001E-3,1.2010300000000001E-3,1.0884099999999999E-3,1.0005400000000001E-3,8.6672799999999999E-4,7.7759400000000005E-4,7.4926799999999998E-4,8.8979499999999997E-4,1.00007E-3,1.12779E-3,1.2133599999999999E-3,1.31218E-3,1.3263999999999999E-3,1.36652E-3,1.39846E-3,1.39755E-3,1.38737E-3,1.372E-3,1.32782E-3,1.2258499999999999E-3,1.1073700000000001E-3,1.0088600000000001E-3,8.6013699999999997E-4,7.1943099999999998E-4]
[null,null,null,563,7.1560500000000002E-4,8.6784399999999999E-4,9.53553E-4,1.0979799999999999E-3,1.2099599999999999E-3,1.28882E-3,1.33303E-3,1.3980799999999999E-3,1.3981600000000001E-3,1.40486E-3,1.4109999999999999E-3,1.4311E-3,1.3241699999999999E-3,1.28874E-3,1.20258E-3,1.1204400000000001E-3,1.0134300000000001E-3,8.4636300000000004E-4,7.5725E-4,7.6199299999999998E-4,8.8966800000000003E-4,1.0158999999999999E-3,1.08314E-3,1.22675E-3,1.2822899999999999E-3,1.3462999999999999E-3,1.3647799999999999E-3,1.41135E-3,1.42427E-3,1.3843799999999999E-3,1.37162E-3,1.32077E-3,1.1931999999999999E-3,1.1164300000000001E-3,9.8385899999999991E-4,8.9262300000000005E-4,7.3852499999999997E-4]
[null,null,null,564,7.9209099999999998E-4,9.0884699999999995E-4,1.0121799999999999E-3,1.12557E-3,1.2524000000000001E-3,1.3575499999999999E-3,1.3988399999999999E-3,1.44378E-3,1.47763E-3,1.43121E-3,1.4678899999999999E-3,1.4532E-3,1.4064100000000001E-3,1.34122E-3,1.24398E-3,1.1467000000000001E-3,1.0396699999999999E-3,8.9680800000000002E-4,7.8911699999999999E-4,7.8859600000000002E-4,9.2461900000000001E-4,1.0407700000000001E-3,1.14499E-3,1.26049E-3,1.3048999999999999E-3,1.41052E-3,1.4191500000000001E-3,1.44969E-3,1.4709300000000001E-3,1.4548E-3,1.4430000000000001E-3,1.3791000000000001E-3,1.30193E-3,1.15215E-3,1.04882E-3,9.2253599999999995E-4,7.7643000000000005E-4]
[null,null,null,565,7.6727100000000003E-4,8.9235499999999995E-4,1.0536600000000001E-3,1.16417E-3,1.2820500000000001E-3,1.35738E-3,1.4049500000000001E-3,1.47864E-3,1.48862E-3,1.48744E-3,1.48211E-3,1.4573100000000001E-3,1.4264200000000001E-3,1.3534199999999999E-3,1.2685699999999999E-3,1.17909E-3,1.0486499999999999E-3,9.4612600000000004E-4,7.8771500000000003E-4,7.8524400000000005E-4,9.2799600000000005E-4,1.0555300000000001E-3,1.18096E-3,1.2736399999999999E-3,1.3330200000000001E-3,1.40145E-3,1.45703E-3,1.49344E-3,1.5202499999999999E-3,1.49223E-3,1.4477800000000001E-3,1.4143700000000001E-3,1.2879E-3,1.18914E-3,1.0537299999999999E-3,9.2928699999999999E-4,7.6721000000000005E-4]
[null,null,null,566,7.7511699999999997E-4,9.1196199999999999E-4,1.03005E-3,1.1847400000000001E-3,1.26807E-3,1.36341E-3,1.4346599999999999E-3,1.46301E-3,1.49019E-3,1.5011E-3,1.4938099999999999E-3,1.4722100000000001E-3,1.4225100000000001E-3,1.3768400000000001E-3,1.2849300000000001E-3,1.17858E-3,1.0550399999999999E-3,9.3539700000000003E-4,7.9032099999999997E-4,7.94007E-4,9.3582599999999995E-4,1.04941E-3,1.17282E-3,1.2794E-3,1.35516E-3,1.3969799999999999E-3,1.4615400000000001E-3,1.5019E-3,1.5008199999999999E-3,1.4962199999999999E-3,1.4453300000000001E-3,1.40066E-3,1.2913499999999999E-3,1.21306E-3,1.03852E-3,9.2420100000000004E-4,7.8566900000000002E-4]
[null,null,null,567,7.5161900000000003E-4,8.8785199999999996E-4,1.0266299999999999E-3,1.17906E-3,1.27973E-3,1.3552900000000001E-3,1.4274400000000001E-3,1.4822699999999999E-3,1.50427E-3,1.51111E-3,1.5090100000000001E-3,1.4944400000000001E-3,1.4284E-3,1.3776000000000001E-3,1.29948E-3,1.1533299999999999E-3,1.0815E-3,9.1779100000000005E-4,7.6187E-4,7.9107899999999998E-4,9.3841400000000004E-4,1.0523799999999999E-3,1.16569E-3,1.29791E-3,1.3481000000000001E-3,1.42655E-3,1.46134E-3,1.5038600000000001E-3,1.5181699999999999E-3,1.47007E-3,1.45886E-3,1.3868000000000001E-3,1.2887599999999999E-3,1.18483E-3,1.0350400000000001E-3,9.1501199999999999E-4,7.8193700000000002E-4]
[null,null,null,568,8.06002E-4,9.4508299999999999E-4,1.10564E-3,1.2246799999999999E-3,1.3386100000000001E-3,1.43688E-3,1.51684E-3,1.5633999999999999E-3,1.6104299999999999E-3,1.57701E-3,1.5632E-3,1.56094E-3,1.4972399999999999E-3,1.4287600000000001E-3,1.34991E-3,1.2488600000000001E-3,1.1278499999999999E-3,1.00709E-3,8.2487700000000001E-4,8.3613600000000002E-4,9.8238699999999993E-4,1.1364000000000001E-3,1.24383E-3,1.3561199999999999E-3,1.45218E-3,1.4859700000000001E-3,1.51447E-3,1.55302E-3,1.6202899999999999E-3,1.5625700000000001E-3,1.5122600000000001E-3,1.49431E-3,1.36108E-3,1.23803E-3,1.11517E-3,9.5239700000000001E-4,8.2825399999999995E-4]
[null,null,null,569,8.3493100000000002E-4,9.9359899999999996E-4,1.13827E-3,1.2629099999999999E-3,1.371E-3,1.44418E-3,1.5469399999999999E-3,1.5822E-3,1.6146000000000001E-3,1.62514E-3,1.6269399999999999E-3,1.5611900000000001E-3,1.5481500000000001E-3,1.4772800000000001E-3,1.39799E-3,1.2621399999999999E-3,1.13681E-3,9.7768000000000009E-4,8.72706E-4,8.7955399999999995E-4,1.0152E-3,1.13239E-3,1.2794200000000001E-3,1.3760700000000001E-3,1.44429E-3,1.50398E-3,1.59359E-3,1.5837500000000001E-3,1.5987499999999999E-3,1.6014E-3,1.55451E-3,1.5072600000000001E-3,1.4113999999999999E-3,1.27531E-3,1.1245999999999999E-3,9.8233999999999995E-4,8.2462900000000001E-4]
[null,null,null,570,8.3871300000000005E-4,9.5611000000000003E-4,1.1232900000000001E-3,1.24215E-3,1.34797E-3,1.47499E-3,1.52158E-3,1.5724300000000001E-3,1.6091499999999999E-3,1.6188299999999999E-3,1.61027E-3,1.5427100000000001E-3,1.5439500000000001E-3,1.45224E-3,1.3746800000000001E-3,1.2344000000000001E-3,1.0964900000000001E-3,9.7526299999999998E-4,8.3332299999999996E-4,8.3202500000000002E-4,9.8624699999999999E-4,1.1374E-3,1.2415499999999999E-3,1.36553E-3,1.4389100000000001E-3,1.52414E-3,1.5664400000000001E-3,1.5890500000000001E-3,1.6098200000000001E-3,1.5883200000000001E-3,1.5204000000000001E-3,1.4435699999999999E-3,1.39131E-3,1.24826E-3,1.1436700000000001E-3,9.4530099999999995E-4,8.1207899999999995E-4]
[null,null,null,571,8.6264100000000004E-4,9.99902E-4,1.1718900000000001E-3,1.2957999999999999E-3,1.4170700000000001E-3,1.51633E-3,1.58139E-3,1.6359199999999999E-3,1.64963E-3,1.67034E-3,1.6576500000000001E-3,1.64157E-3,1.5840800000000001E-3,1.50059E-3,1.4279E-3,1.3052000000000001E-3,1.1734899999999999E-3,1.01555E-3,8.6883800000000003E-4,8.8123800000000001E-4,1.0389900000000001E-3,1.1774999999999999E-3,1.29451E-3,1.41883E-3,1.49672E-3,1.55451E-3,1.64697E-3,1.64949E-3,1.67136E-3,1.66125E-3,1.60446E-3,1.5309099999999999E-3,1.44421E-3,1.2945000000000001E-3,1.157E-3,1.01435E-3,8.5992299999999996E-4]
[null,null,null,572,8.4654399999999996E-4,9.9383000000000002E-4,1.1530399999999999E-3,1.2894499999999999E-3,1.4240100000000001E-3,1.49679E-3,1.5997299999999999E-3,1.63711E-3,1.66705E-3,1.6683799999999999E-3,1.6543599999999999E-3,1.6339200000000001E-3,1.5881999999999999E-3,1.50296E-3,1.4150600000000001E-3,1.3163599999999999E-3,1.16091E-3,1.01672E-3,8.7430299999999999E-4,8.7340499999999995E-4,1.0123599999999999E-3,1.1702399999999999E-3,1.2967199999999999E-3,1.41712E-3,1.4975800000000001E-3,1.5690999999999999E-3,1.63153E-3,1.65906E-3,1.6626499999999999E-3,1.6479400000000001E-3,1.60855E-3,1.5471300000000001E-3,1.44764E-3,1.2981399999999999E-3,1.1700700000000001E-3,1.01278E-3,8.46863E-4]
[null,null,null,573,8.8049600000000003E-4,1.03224E-3,1.17168E-3,1.3361200000000001E-3,1.4678200000000001E-3,1.5389500000000001E-3,1.62838E-3,1.6838199999999999E-3,1.67651E-3,1.6890399999999999E-3,1.71083E-3,1.6643700000000001E-3,1.61824E-3,1.5485099999999999E-3,1.4565800000000001E-3,1.34073E-3,1.19418E-3,1.03786E-3,8.8362900000000003E-4,9.0085600000000001E-4,1.0177299999999999E-3,1.2157100000000001E-3,1.32087E-3,1.4433E-3,1.55258E-3,1.6403100000000001E-3,1.65723E-3,1.6772899999999999E-3,1.69461E-3,1.6809500000000001E-3,1.6454900000000001E-3,1.57555E-3,1.5018500000000001E-3,1.33059E-3,1.2153400000000001E-3,1.04809E-3,8.9290599999999995E-4]
[null,null,null,574,8.9284E-4,1.0504100000000001E-3,1.19746E-3,1.3615299999999999E-3,1.48069E-3,1.5958599999999999E-3,1.6654700000000001E-3,1.6961999999999999E-3,1.6941700000000001E-3,1.7413999999999999E-3,1.72701E-3,1.69951E-3,1.66964E-3,1.59767E-3,1.48835E-3,1.38437E-3,1.1756799999999999E-3,1.04185E-3,9.35581E-4,9.1814000000000002E-4,1.06431E-3,1.21386E-3,1.34162E-3,1.47349E-3,1.5709299999999999E-3,1.64588E-3,1.6909900000000001E-3,1.7126299999999999E-3,1.72065E-3,1.69651E-3,1.6659400000000001E-3,1.57149E-3,1.50987E-3,1.3324999999999999E-3,1.23032E-3,1.05456E-3,8.8677199999999997E-4]
[null,null,null,575,9.1208900000000004E-4,1.06842E-3,1.2304099999999999E-3,1.3723800000000001E-3,1.49781E-3,1.6029900000000001E-3,1.6815300000000001E-3,1.7152300000000001E-3,1.76694E-3,1.7898899999999999E-3,1.76513E-3,1.7081500000000001E-3,1.7069800000000001E-3,1.62028E-3,1.5001599999999999E-3,1.3952599999999999E-3,1.2317700000000001E-3,1.09925E-3,9.2531799999999995E-4,9.5681599999999998E-4,1.1182799999999999E-3,1.2625100000000001E-3,1.37875E-3,1.51347E-3,1.5924800000000001E-3,1.6516499999999999E-3,1.7229700000000001E-3,1.7469300000000001E-3,1.76132E-3,1.75085E-3,1.6996299999999999E-3,1.6153599999999999E-3,1.5120800000000001E-3,1.39186E-3,1.25249E-3,1.0951699999999999E-3,9.1883700000000004E-4]
[null,null,null,576,9.1869499999999997E-4,1.0713000000000001E-3,1.23949E-3,1.39953E-3,1.53426E-3,1.6362200000000001E-3,1.71137E-3,1.7640900000000001E-3,1.7795199999999999E-3,1.80051E-3,1.7902199999999999E-3,1.7532699999999999E-3,1.71261E-3,1.65135E-3,1.5271600000000001E-3,1.3922699999999999E-3,1.2482000000000001E-3,1.0903099999999999E-3,9.3501800000000003E-4,9.5747400000000004E-4,1.1161999999999999E-3,1.2683600000000001E-3,1.4175699999999999E-3,1.5097699999999999E-3,1.6252199999999999E-3,1.6883099999999999E-3,1.7275599999999999E-3,1.7631400000000001E-3,1.7795199999999999E-3,1.79006E-3,1.71418E-3,1.64627E-3,1.5394199999999999E-3,1.4318600000000001E-3,1.23992E-3,1.0792499999999999E-3,9.1320699999999997E-4]
[null,null,null,577,9.0599599999999995E-4,1.0823600000000001E-3,1.25588E-3,1.41891E-3,1.55145E-3,1.64526E-3,1.70864E-3,1.7652099999999999E-3,1.79221E-3,1.8065799999999999E-3,1.79558E-3,1.78229E-3,1.7234399999999999E-3,1.6533699999999999E-3,1.5510999999999999E-3,1.4127899999999999E-3,1.25965E-3,1.1011E-3,9.3978099999999999E-4,9.4561999999999999E-4,1.1248899999999999E-3,1.2616299999999999E-3,1.4206100000000001E-3,1.5267499999999999E-3,1.62488E-3,1.7077800000000001E-3,1.7614499999999999E-3,1.7999699999999999E-3,1.80419E-3,1.80875E-3,1.75113E-3,1.68034E-3,1.53992E-3,1.4129399999999999E-3,1.25486E-3,1.0870599999999999E-3,9.1937300000000002E-4]
[null,null,null,578,9.3785899999999998E-4,1.0994100000000001E-3,1.2519499999999999E-3,1.4480999999999999E-3,1.5415699999999999E-3,1.6924100000000001E-3,1.7571100000000001E-3,1.79507E-3,1.80265E-3,1.8357E-3,1.8396599999999999E-3,1.80744E-3,1.74782E-3,1.6750300000000001E-3,1.5512200000000001E-3,1.4368899999999999E-3,1.29152E-3,1.1175600000000001E-3,9.3730899999999999E-4,9.7740499999999998E-4,1.1146400000000001E-3,1.2775099999999999E-3,1.4165099999999999E-3,1.5675699999999999E-3,1.6648699999999999E-3,1.7568200000000001E-3,1.7966E-3,1.79934E-3,1.8228700000000001E-3,1.82833E-3,1.7705500000000001E-3,1.71207E-3,1.57727E-3,1.42841E-3,1.2744099999999999E-3,1.12381E-3,9.3851399999999999E-4]
[null,null,null,579,9.6430599999999995E-4,1.13452E-3,1.3041699999999999E-3,1.4789E-3,1.62174E-3,1.7300900000000001E-3,1.81061E-3,1.8606600000000001E-3,1.88536E-3,1.89927E-3,1.9072E-3,1.8514600000000001E-3,1.85356E-3,1.7394699999999999E-3,1.62211E-3,1.49507E-3,1.31729E-3,1.1746700000000001E-3,9.8850999999999995E-4,9.886160000000001E-4,1.1908999999999999E-3,1.3518E-3,1.4625300000000001E-3,1.61089E-3,1.73116E-3,1.78345E-3,1.8360900000000001E-3,1.85736E-3,1.8908E-3,1.8689500000000001E-3,1.8087400000000001E-3,1.7411200000000001E-3,1.6333999999999999E-3,1.4520900000000001E-3,1.29542E-3,1.12663E-3,1.0025500000000001E-3]
[null,null,null,580,1.0107E-3,1.15441E-3,1.3429500000000001E-3,1.5025500000000001E-3,1.6634200000000001E-3,1.74361E-3,1.84771E-3,1.89241E-3,1.9293400000000001E-3,1.94136E-3,1.91854E-3,1.89617E-3,1.8297299999999999E-3,1.7597800000000001E-3,1.6672099999999999E-3,1.51626E-3,1.3715800000000001E-3,1.1869199999999999E-3,1.01398E-3,1.02622E-3,1.20739E-3,1.3491099999999999E-3,1.5240099999999999E-3,1.6342500000000001E-3,1.73077E-3,1.8169099999999999E-3,1.86881E-3,1.92772E-3,1.9001000000000001E-3,1.9175399999999999E-3,1.88733E-3,1.7785100000000001E-3,1.64332E-3,1.5119899999999999E-3,1.3449899999999999E-3,1.1610699999999999E-3,1.0051000000000001E-3]
[null,null,null,581,1.0083799999999999E-3,1.1787099999999999E-3,1.34772E-3,1.5315000000000001E-3,1.67213E-3,1.77709E-3,1.8833400000000001E-3,1.8999799999999999E-3,1.93564E-3,1.97197E-3,1.94191E-3,1.9057799999999999E-3,1.83731E-3,1.78258E-3,1.6810200000000001E-3,1.53801E-3,1.3839200000000001E-3,1.1713400000000001E-3,1.0169300000000001E-3,1.02188E-3,1.2012399999999999E-3,1.3762799999999999E-3,1.52151E-3,1.6439200000000001E-3,1.77601E-3,1.8504800000000001E-3,1.8847499999999999E-3,1.9369999999999999E-3,1.9309100000000001E-3,1.93581E-3,1.90325E-3,1.80857E-3,1.66361E-3,1.54178E-3,1.3832899999999999E-3,1.18486E-3,1.0037799999999999E-3]
[null,null,null,582,1.05185E-3,1.2244700000000001E-3,1.4076E-3,1.57906E-3,1.7201199999999999E-3,1.82826E-3,1.9223899999999999E-3,1.95649E-3,2.0097600000000002E-3,2.0291200000000001E-3,2.0002900000000001E-3,1.9786600000000001E-3,1.9186800000000001E-3,1.8354199999999999E-3,1.7120600000000001E-3,1.58314E-3,1.4109299999999999E-3,1.22459E-3,1.0682000000000001E-3,1.0646E-3,1.2691E-3,1.4322499999999999E-3,1.5806800000000001E-3,1.70663E-3,1.84552E-3,1.8930900000000001E-3,1.9639200000000001E-3,2.00504E-3,2.0031200000000002E-3,2.0010200000000001E-3,1.9507999999999999E-3,1.8690499999999999E-3,1.7345100000000001E-3,1.59168E-3,1.43793E-3,1.2329699999999999E-3,1.0565500000000001E-3]
[null,null,null,583,1.0490499999999999E-3,1.2322699999999999E-3,1.39601E-3,1.58172E-3,1.7204099999999999E-3,1.8524699999999999E-3,1.93129E-3,1.9722099999999998E-3,1.9970399999999998E-3,2.0098799999999999E-3,1.9914300000000002E-3,1.9855599999999999E-3,1.94575E-3,1.8422600000000001E-3,1.7343599999999999E-3,1.6083200000000001E-3,1.42997E-3,1.23434E-3,1.06718E-3,1.0599800000000001E-3,1.2484200000000001E-3,1.4353199999999999E-3,1.5621599999999999E-3,1.7189E-3,1.85092E-3,1.90639E-3,1.99052E-3,2.0030099999999999E-3,2.0188900000000002E-3,2.0070700000000001E-3,1.9286399999999999E-3,1.8674900000000001E-3,1.75812E-3,1.5799200000000001E-3,1.4111E-3,1.2107699999999999E-3,1.0563300000000001E-3]
[null,null,null,584,1.0408800000000001E-3,1.2270499999999999E-3,1.4268900000000001E-3,1.5502599999999999E-3,1.70667E-3,1.8302100000000001E-3,1.9458800000000001E-3,1.9775299999999999E-3,2.0090099999999999E-3,2.0208399999999999E-3,1.98993E-3,1.9935999999999999E-3,1.94604E-3,1.83194E-3,1.69875E-3,1.5804899999999999E-3,1.3981600000000001E-3,1.2088699999999999E-3,1.0468000000000001E-3,1.0618800000000001E-3,1.27151E-3,1.4495700000000001E-3,1.60327E-3,1.68866E-3,1.8248299999999999E-3,1.9434299999999999E-3,1.9696900000000001E-3,2.0241399999999998E-3,2.01081E-3,2.0129700000000002E-3,1.94052E-3,1.8559399999999999E-3,1.74654E-3,1.58723E-3,1.43688E-3,1.20784E-3,1.0121500000000001E-3]
[null,null,null,585,1.0353700000000001E-3,1.22711E-3,1.41121E-3,1.6043400000000001E-3,1.72612E-3,1.85063E-3,1.9664499999999998E-3,1.9959999999999999E-3,2.0305599999999998E-3,2.0637699999999999E-3,2.01877E-3,1.9920200000000002E-3,1.94304E-3,1.8586E-3,1.7423600000000001E-3,1.583E-3,1.42008E-3,1.23632E-3,1.07296E-3,1.0797999999999999E-3,1.2775600000000001E-3,1.4328399999999999E-3,1.6201E-3,1.7440000000000001E-3,1.8677699999999999E-3,1.8980500000000001E-3,1.99453E-3,2.03185E-3,2.0347999999999998E-3,2.02141E-3,1.95524E-3,1.8873099999999999E-3,1.74664E-3,1.59928E-3,1.4379499999999999E-3,1.2373099999999999E-3,1.05386E-3]
[null,null,null,586,1.07682E-3,1.23518E-3,1.43413E-3,1.6195300000000001E-3,1.75354E-3,1.87094E-3,1.9707700000000002E-3,2.0274300000000002E-3,2.0609299999999999E-3,2.0824300000000001E-3,2.0460500000000002E-3,1.9871200000000002E-3,1.9632600000000001E-3,1.87243E-3,1.78155E-3,1.61509E-3,1.42851E-3,1.25081E-3,1.0882800000000001E-3,1.0900599999999999E-3,1.2803199999999999E-3,1.44257E-3,1.6243900000000001E-3,1.7411E-3,1.88054E-3,1.9286399999999999E-3,2.01183E-3,2.0465700000000002E-3,2.10428E-3,2.0705099999999998E-3,1.98351E-3,1.9018100000000001E-3,1.7875199999999999E-3,1.6189100000000001E-3,1.43713E-3,1.23609E-3,1.0643499999999999E-3]
[null,null,null,587,1.06449E-3,1.27593E-3,1.4796799999999999E-3,1.63645E-3,1.7992100000000001E-3,1.8923099999999999E-3,2.0079899999999999E-3,2.07793E-3,2.0953999999999999E-3,2.1105500000000001E-3,2.062E-3,2.0327100000000001E-3,1.99023E-3,1.9122E-3,1.8031099999999999E-3,1.6308500000000001E-3,1.43724E-3,1.27502E-3,1.10063E-3,1.1121799999999999E-3,1.28998E-3,1.4692500000000001E-3,1.63872E-3,1.76399E-3,1.8851499999999999E-3,1.9680800000000001E-3,2.01936E-3,2.0747299999999999E-3,2.1084599999999999E-3,2.0924400000000001E-3,1.9960400000000001E-3,1.9229200000000001E-3,1.7993799999999999E-3,1.6344300000000001E-3,1.4628E-3,1.27473E-3,1.0701899999999999E-3]
[null,null,null,588,1.1120100000000001E-3,1.30528E-3,1.4960399999999999E-3,1.69305E-3,1.8491600000000001E-3,1.94776E-3,2.0714100000000001E-3,2.1106699999999998E-3,2.1380700000000002E-3,2.1768899999999999E-3,2.1285700000000002E-3,2.1150100000000001E-3,2.06464E-3,1.9927299999999998E-3,1.8439699999999999E-3,1.71667E-3,1.4979399999999999E-3,1.32391E-3,1.1389799999999999E-3,1.18344E-3,1.3298800000000001E-3,1.5340200000000001E-3,1.68088E-3,1.8175999999999999E-3,1.9504800000000001E-3,2.0241600000000001E-3,2.0870699999999999E-3,2.1302399999999998E-3,2.14445E-3,2.12079E-3,2.06201E-3,1.9807000000000002E-3,1.83622E-3,1.7054399999999999E-3,1.5238599999999999E-3,1.3276500000000001E-3,1.09483E-3]
[null,null,null,589,1.1202300000000001E-3,1.3019500000000001E-3,1.50786E-3,1.6965999999999999E-3,1.8280200000000001E-3,1.9518199999999999E-3,2.04754E-3,2.1000099999999998E-3,2.1303699999999999E-3,2.1375399999999998E-3,2.1435999999999998E-3,2.10575E-3,2.0624800000000002E-3,1.9808199999999999E-3,1.8330200000000001E-3,1.66905E-3,1.4931E-3,1.2898899999999999E-3,1.1326400000000001E-3,1.1141499999999999E-3,1.3225000000000001E-3,1.52118E-3,1.66591E-3,1.84326E-3,1.9473699999999999E-3,2.0095099999999999E-3,2.1113299999999998E-3,2.11662E-3,2.1413399999999998E-3,2.1075099999999999E-3,2.0672099999999999E-3,1.9737800000000001E-3,1.8439800000000001E-3,1.6606699999999999E-3,1.4885199999999999E-3,1.2784599999999999E-3,1.0900899999999999E-3]
[null,null,null,590,1.1098799999999999E-3,1.3080399999999999E-3,1.5292999999999999E-3,1.6977800000000001E-3,1.8441200000000001E-3,1.9921700000000001E-3,2.0572300000000002E-3,2.1290699999999998E-3,2.1567000000000001E-3,2.1737100000000001E-3,2.1643399999999998E-3,2.1447300000000001E-3,2.0709999999999999E-3,1.9674699999999998E-3,1.8374999999999999E-3,1.71616E-3,1.5128800000000001E-3,1.32102E-3,1.1363199999999999E-3,1.1425599999999999E-3,1.3464099999999999E-3,1.51603E-3,1.719E-3,1.8419700000000001E-3,1.9654199999999998E-3,2.0626799999999999E-3,2.1417099999999998E-3,2.13197E-3,2.18688E-3,2.1618700000000002E-3,2.1019900000000002E-3,2.0089600000000002E-3,1.87918E-3,1.7292099999999999E-3,1.49683E-3,1.3169900000000001E-3,1.11192E-3]
[null,null,null,591,1.1226299999999999E-3,1.3189899999999999E-3,1.5335699999999999E-3,1.7044899999999999E-3,1.8728E-3,1.9983000000000002E-3,2.07888E-3,2.1591800000000001E-3,2.17804E-3,2.21332E-3,2.1603999999999998E-3,2.1898400000000002E-3,2.0900300000000001E-3,2.0117400000000001E-3,1.87521E-3,1.72493E-3,1.54901E-3,1.3234799999999999E-3,1.1400200000000001E-3,1.1346500000000001E-3,1.36428E-3,1.5374E-3,1.7164599999999999E-3,1.8765399999999999E-3,1.9932000000000001E-3,2.0772E-3,2.1582799999999998E-3,2.1738600000000001E-3,2.2110300000000001E-3,2.17891E-3,2.1278600000000001E-3,1.9821999999999999E-3,1.88838E-3,1.7239099999999999E-3,1.53141E-3,1.3340299999999999E-3,1.1056200000000001E-3]
[null,null,null,592,1.1407500000000001E-3,1.3144999999999999E-3,1.544E-3,1.7285E-3,1.88554E-3,2.01081E-3,2.1019699999999999E-3,2.1939799999999999E-3,2.1909999999999998E-3,2.19885E-3,2.1825999999999998E-3,2.1823300000000001E-3,2.1118299999999999E-3,2.0172300000000001E-3,1.87755E-3,1.7284799999999999E-3,1.5317E-3,1.3442599999999999E-3,1.1366900000000001E-3,1.1483699999999999E-3,1.37806E-3,1.56559E-3,1.7236199999999999E-3,1.8774900000000001E-3,2.0106099999999999E-3,2.11408E-3,2.1442700000000002E-3,2.1767800000000001E-3,2.2249100000000001E-3,2.1975800000000002E-3,2.1274000000000002E-3,2.0512899999999999E-3,1.8974700000000001E-3,1.7221700000000001E-3,1.5310499999999999E-3,1.3450999999999999E-3,1.12476E-3]
[null,null,null,593,1.1341299999999999E-3,1.3457E-3,1.5254299999999999E-3,1.72471E-3,1.8909199999999999E-3,2.01637E-3,2.1330300000000002E-3,2.1714999999999998E-3,2.2049999999999999E-3,2.2078200000000001E-3,2.1772100000000002E-3,2.20119E-3,2.1006200000000001E-3,2.02118E-3,1.88846E-3,1.72813E-3,1.5725699999999999E-3,1.3714899999999999E-3,1.1576799999999999E-3,1.1952499999999999E-3,1.37297E-3,1.5666499999999999E-3,1.73496E-3,1.87302E-3,2.0029800000000001E-3,2.1272800000000001E-3,2.1818699999999998E-3,2.1951200000000001E-3,2.2198399999999998E-3,2.1957999999999999E-3,2.15912E-3,2.0182899999999998E-3,1.9093300000000001E-3,1.73858E-3,1.53619E-3,1.34271E-3,1.12443E-3]
[null,null,null,594,1.1364400000000001E-3,1.3636E-3,1.5594199999999999E-3,1.7412899999999999E-3,1.9237E-3,2.04171E-3,2.11108E-3,2.20353E-3,2.2328500000000002E-3,2.2109E-3,2.2412399999999998E-3,2.2025899999999999E-3,2.1570299999999999E-3,2.03126E-3,1.90139E-3,1.7383500000000001E-3,1.5823300000000001E-3,1.3487900000000001E-3,1.1703900000000001E-3,1.19528E-3,1.3931E-3,1.5822799999999999E-3,1.77494E-3,1.8869799999999999E-3,2.0224599999999998E-3,2.12648E-3,2.1643399999999998E-3,2.2079199999999999E-3,2.2631800000000001E-3,2.2013699999999998E-3,2.1316600000000001E-3,2.0701399999999998E-3,1.9231700000000001E-3,1.7512700000000001E-3,1.5473500000000001E-3,1.33771E-3,1.14964E-3]
[null,null,null,595,1.1266399999999999E-3,1.3328599999999999E-3,1.5619900000000001E-3,1.7234500000000001E-3,1.91219E-3,2.0360999999999999E-3,2.11998E-3,2.2091599999999999E-3,2.2351699999999999E-3,2.2067300000000001E-3,2.24471E-3,2.1820300000000002E-3,2.13459E-3,2.03105E-3,1.9176200000000001E-3,1.7681999999999999E-3,1.5473900000000001E-3,1.35892E-3,1.14547E-3,1.16953E-3,1.3691700000000001E-3,1.5627799999999999E-3,1.75257E-3,1.89084E-3,2.03381E-3,2.1117599999999999E-3,2.1594499999999998E-3,2.2191899999999998E-3,2.2182600000000001E-3,2.2175300000000001E-3,2.1491399999999999E-3,2.0656200000000002E-3,1.92202E-3,1.7506100000000001E-3,1.5508799999999999E-3,1.3435700000000001E-3,1.1100800000000001E-3]
[null,null,null,596,1.1338400000000001E-3,1.37783E-3,1.5661399999999999E-3,1.77433E-3,1.94582E-3,2.0577099999999999E-3,2.14263E-3,2.2355700000000001E-3,2.2736000000000002E-3,2.2766499999999999E-3,2.26143E-3,2.23844E-3,2.1669800000000002E-3,2.0860100000000001E-3,1.9525E-3,1.7799199999999999E-3,1.56624E-3,1.38535E-3,1.17541E-3,1.1843800000000001E-3,1.3923500000000001E-3,1.6038199999999999E-3,1.78397E-3,1.9361300000000001E-3,2.0831399999999998E-3,2.14058E-3,2.2086300000000001E-3,2.2464799999999999E-3,2.2773200000000002E-3,2.2280899999999998E-3,2.1694000000000001E-3,2.0673000000000002E-3,1.9562400000000001E-3,1.7647800000000001E-3,1.5928299999999999E-3,1.36399E-3,1.1429999999999999E-3]
[null,null,null,597,1.16825E-3,1.39569E-3,1.58329E-3,1.7787199999999999E-3,1.9966900000000002E-3,2.09004E-3,2.1717300000000002E-3,2.2472199999999999E-3,2.3117799999999998E-3,2.3215599999999999E-3,2.2866000000000002E-3,2.2485199999999999E-3,2.2036400000000002E-3,2.1178600000000001E-3,1.9798300000000001E-3,1.79451E-3,1.61835E-3,1.40591E-3,1.2185E-3,1.2107299999999999E-3,1.4135300000000001E-3,1.63806E-3,1.8082700000000001E-3,1.9680000000000001E-3,2.1030599999999999E-3,2.1578499999999998E-3,2.2507999999999998E-3,2.2678799999999999E-3,2.2899700000000001E-3,2.2868900000000002E-3,2.19856E-3,2.1029600000000001E-3,1.96795E-3,1.8276E-3,1.64241E-3,1.39091E-3,1.1857E-3]
[null,null,null,598,1.1967900000000001E-3,1.37564E-3,1.56537E-3,1.7768700000000001E-3,1.9275099999999999E-3,2.0668100000000001E-3,2.1756000000000002E-3,2.2364300000000002E-3,2.2465900000000001E-3,2.2751199999999998E-3,2.29502E-3,2.27312E-3,2.1802800000000002E-3,2.0710799999999999E-3,1.9579200000000001E-3,1.79929E-3,1.59728E-3,1.39864E-3,1.1832399999999999E-3,1.2117E-3,1.41759E-3,1.58639E-3,1.79576E-3,1.9562799999999999E-3,2.05419E-3,2.1429999999999999E-3,2.2195399999999999E-3,2.2594999999999998E-3,2.28247E-3,2.2555299999999999E-3,2.19454E-3,2.1456700000000001E-3,1.9510700000000001E-3,1.77316E-3,1.6010099999999999E-3,1.3936599999999999E-3,1.1915700000000001E-3]
[null,null,null,599,1.1798799999999999E-3,1.3807699999999999E-3,1.58215E-3,1.77907E-3,1.93888E-3,2.1069299999999999E-3,2.17315E-3,2.23215E-3,2.29635E-3,2.28554E-3,2.2900199999999998E-3,2.2538800000000002E-3,2.1701099999999998E-3,2.0925399999999999E-3,1.92472E-3,1.7909499999999999E-3,1.59417E-3,1.3782E-3,1.18622E-3,1.1651299999999999E-3,1.3742100000000001E-3,1.6099E-3,1.7786600000000001E-3,1.9804800000000002E-3,2.06916E-3,2.15212E-3,2.2065299999999999E-3,2.2629299999999998E-3,2.2685100000000001E-3,2.2341399999999999E-3,2.1951700000000002E-3,2.10538E-3,1.9575600000000001E-3,1.7918700000000001E-3,1.58132E-3,1.37375E-3,1.1487800000000001E-3]
[null,null,null,600,1.1722499999999999E-3,1.3905600000000001E-3,1.58011E-3,1.7749E-3,1.9560699999999999E-3,2.0860499999999999E-3,2.1964100000000002E-3,2.23295E-3,2.2542E-3,2.32139E-3,2.2818299999999999E-3,2.2632199999999998E-3,2.163E-3,2.10371E-3,1.9632199999999999E-3,1.8132300000000001E-3,1.6121600000000001E-3,1.40763E-3,1.2028500000000001E-3,1.2035699999999999E-3,1.42983E-3,1.62685E-3,1.80365E-3,1.9514999999999999E-3,2.08296E-3,2.1724399999999999E-3,2.2240099999999998E-3,2.2631499999999998E-3,2.2973300000000002E-3,2.2771499999999999E-3,2.22163E-3,2.1308299999999998E-3,1.9588000000000001E-3,1.77563E-3,1.5953499999999999E-3,1.3761100000000001E-3,1.1600099999999999E-3]
[null,null,null,601,1.1900400000000001E-3,1.40492E-3,1.59796E-3,1.8117299999999999E-3,1.99518E-3,2.11349E-3,2.2073399999999999E-3,2.2649300000000001E-3,2.3040500000000002E-3,2.3263400000000001E-3,2.3162199999999999E-3,2.2581300000000001E-3,2.21229E-3,2.12576E-3,1.9706699999999999E-3,1.8162899999999999E-3,1.62492E-3,1.41895E-3,1.1938599999999999E-3,1.2161400000000001E-3,1.4429600000000001E-3,1.6397300000000001E-3,1.8275699999999999E-3,1.9841699999999999E-3,2.1025200000000001E-3,2.1867800000000001E-3,2.2576699999999998E-3,2.3048399999999998E-3,2.3119500000000001E-3,2.2958499999999999E-3,2.2437099999999999E-3,2.14423E-3,1.9895799999999999E-3,1.8036599999999999E-3,1.61604E-3,1.36196E-3,1.1934599999999999E-3]
[null,null,null,602,1.1670999999999999E-3,1.4015099999999999E-3,1.6151200000000001E-3,1.7962399999999999E-3,1.9916999999999999E-3,2.0864299999999998E-3,2.2235599999999999E-3,2.2590599999999998E-3,2.2840999999999998E-3,2.3282400000000001E-3,2.3076400000000001E-3,2.2669700000000001E-3,2.2043100000000001E-3,2.1063900000000001E-3,1.9446699999999999E-3,1.8057699999999999E-3,1.6233899999999999E-3,1.3980900000000001E-3,1.1785599999999999E-3,1.2172800000000001E-3,1.3915500000000001E-3,1.6335399999999999E-3,1.81836E-3,1.98313E-3,2.05747E-3,2.1651999999999999E-3,2.2520600000000002E-3,2.29999E-3,2.2765099999999998E-3,2.2882000000000002E-3,2.2400699999999998E-3,2.11093E-3,1.98036E-3,1.82157E-3,1.60323E-3,1.3785099999999999E-3,1.16559E-3]
[null,null,null,603,1.1517700000000001E-3,1.37079E-3,1.57292E-3,1.75687E-3,1.9486499999999999E-3,2.0493099999999999E-3,2.1753800000000002E-3,2.2598100000000001E-3,2.2927300000000002E-3,2.28897E-3,2.2393000000000001E-3,2.2449700000000002E-3,2.1683200000000001E-3,2.09407E-3,1.9577399999999999E-3,1.78488E-3,1.5441299999999999E-3,1.4265199999999999E-3,1.1590299999999999E-3,1.18593E-3,1.3732E-3,1.59337E-3,1.79755E-3,1.9426300000000001E-3,2.0970300000000002E-3,2.16285E-3,2.2279600000000002E-3,2.2395100000000001E-3,2.29321E-3,2.24983E-3,2.2221099999999998E-3,2.10626E-3,1.97314E-3,1.78652E-3,1.5860200000000001E-3,1.2992800000000001E-3,1.1516199999999999E-3]
[null,null,null,604,1.1316399999999999E-3,1.3521500000000001E-3,1.5668399999999999E-3,1.7691499999999999E-3,1.9213800000000001E-3,2.0746200000000001E-3,2.16863E-3,2.2326899999999998E-3,2.2771499999999999E-3,2.2622699999999998E-3,2.2403499999999999E-3,2.22186E-3,2.1655099999999998E-3,2.0691300000000002E-3,1.92406E-3,1.7507899999999999E-3,1.5812599999999999E-3,1.3817899999999999E-3,1.1593599999999999E-3,1.16748E-3,1.3651900000000001E-3,1.5940399999999999E-3,1.7511099999999999E-3,1.9132000000000001E-3,2.0855499999999998E-3,2.1656599999999998E-3,2.2206999999999999E-3,2.2549200000000001E-3,2.2994999999999999E-3,2.25414E-3,2.20236E-3,2.0861999999999999E-3,1.96072E-3,1.7874799999999999E-3,1.5670599999999999E-3,1.3489800000000001E-3,1.13462E-3]
[null,null,null,605,1.1748800000000001E-3,1.37411E-3,1.5865300000000001E-3,1.77001E-3,1.9621399999999998E-3,2.0954300000000001E-3,2.1987600000000001E-3,2.2902700000000001E-3,2.3166699999999998E-3,2.30518E-3,2.2999600000000002E-3,2.2719200000000002E-3,2.2094200000000001E-3,2.0793700000000001E-3,1.9513E-3,1.77775E-3,1.59917E-3,1.39857E-3,1.18282E-3,1.21929E-3,1.41296E-3,1.6039699999999999E-3,1.8077900000000001E-3,1.94637E-3,2.07968E-3,2.2072699999999999E-3,2.2177199999999998E-3,2.2891600000000002E-3,2.3228400000000001E-3,2.2760699999999998E-3,2.2055299999999998E-3,2.1009100000000001E-3,2.0086499999999998E-3,1.7871899999999999E-3,1.6046400000000001E-3,1.3723699999999999E-3,1.1643000000000001E-3]
[null,null,null,606,1.1800199999999999E-3,1.3743200000000001E-3,1.6058400000000001E-3,1.7989E-3,1.96904E-3,2.1119300000000001E-3,2.2035800000000001E-3,2.2844200000000001E-3,2.3149500000000001E-3,2.3051999999999999E-3,2.3079699999999999E-3,2.2669700000000001E-3,2.2104099999999999E-3,2.13342E-3,1.97482E-3,1.79083E-3,1.6156300000000001E-3,1.39314E-3,1.1856600000000001E-3,1.23967E-3,1.4386100000000001E-3,1.61549E-3,1.81609E-3,1.9800500000000001E-3,2.08596E-3,2.2100000000000002E-3,2.2644499999999999E-3,2.3129700000000001E-3,2.31796E-3,2.3147599999999999E-3,2.2095999999999999E-3,2.12838E-3,1.9933199999999998E-3,1.80985E-3,1.60753E-3,1.3787999999999999E-3,1.1787099999999999E-3]
[null,null,null,607,1.18778E-3,1.4005700000000001E-3,1.60574E-3,1.7888299999999999E-3,1.9653000000000001E-3,2.1309300000000001E-3,2.2106600000000001E-3,2.2452100000000001E-3,2.3057099999999999E-3,2.3288499999999999E-3,2.32943E-3,2.2699999999999999E-3,2.2060399999999998E-3,2.10815E-3,1.9756999999999999E-3,1.78444E-3,1.6264599999999999E-3,1.4178000000000001E-3,1.1968E-3,1.21082E-3,1.4154300000000001E-3,1.63383E-3,1.8058900000000001E-3,1.9846999999999998E-3,2.0659200000000002E-3,2.18994E-3,2.2539399999999998E-3,2.2985100000000001E-3,2.3125300000000001E-3,2.2876400000000001E-3,2.2155999999999999E-3,2.1142299999999999E-3,2.0067599999999998E-3,1.78875E-3,1.5997400000000001E-3,1.3732900000000001E-3,1.18833E-3]
[null,null,null,608,1.1931299999999999E-3,1.4111499999999999E-3,1.61389E-3,1.80832E-3,2.0010399999999999E-3,2.11071E-3,2.1969699999999999E-3,2.2590900000000001E-3,2.3214199999999998E-3,2.3030500000000001E-3,2.3113000000000001E-3,2.26626E-3,2.1939899999999998E-3,2.1124199999999998E-3,1.9919400000000002E-3,1.8419300000000001E-3,1.61527E-3,1.3936899999999999E-3,1.2065299999999999E-3,1.2089500000000001E-3,1.42812E-3,1.6370200000000001E-3,1.8416999999999999E-3,1.9430999999999999E-3,2.1005500000000001E-3,2.17687E-3,2.26749E-3,2.2808500000000001E-3,2.3100899999999999E-3,2.2814100000000002E-3,2.1984299999999999E-3,2.11641E-3,1.9777100000000001E-3,1.78593E-3,1.6120799999999999E-3,1.3861100000000001E-3,1.18341E-3]
[null,null,null,609,1.1431E-3,1.3605500000000001E-3,1.5721299999999999E-3,1.7891700000000001E-3,1.9636599999999999E-3,2.0835200000000002E-3,2.1770600000000002E-3,2.2446900000000001E-3,2.2771800000000002E-3,2.2756299999999998E-3,2.26253E-3,2.2245500000000001E-3,2.1707599999999999E-3,2.0662300000000001E-3,1.9382100000000001E-3,1.80532E-3,1.575E-3,1.39207E-3,1.19382E-3,1.21053E-3,1.3939899999999999E-3,1.6074800000000001E-3,1.78495E-3,1.9565300000000002E-3,2.06033E-3,2.1539100000000002E-3,2.2069699999999999E-3,2.26458E-3,2.29518E-3,2.2272699999999999E-3,2.21068E-3,2.0801999999999999E-3,1.9624199999999999E-3,1.78681E-3,1.5981400000000001E-3,1.3703599999999999E-3,1.12565E-3]
[null,null,null,610,1.14069E-3,1.3785900000000001E-3,1.5620499999999999E-3,1.7953299999999999E-3,1.94769E-3,2.0724599999999999E-3,2.1795199999999999E-3,2.25997E-3,2.2586099999999999E-3,2.2704800000000001E-3,2.2853399999999999E-3,2.20053E-3,2.1681600000000001E-3,2.0672199999999998E-3,1.9207E-3,1.7584E-3,1.5665500000000001E-3,1.3917300000000001E-3,1.17359E-3,1.1895600000000001E-3,1.3890700000000001E-3,1.5809699999999999E-3,1.7809499999999999E-3,1.9587300000000001E-3,2.0487000000000001E-3,2.1804799999999998E-3,2.2142400000000001E-3,2.2520399999999999E-3,2.2892799999999999E-3,2.2286699999999999E-3,2.18133E-3,2.0576399999999999E-3,1.95133E-3,1.7931900000000001E-3,1.5646099999999999E-3,1.36316E-3,1.14555E-3]
[null,null,null,611,1.1622E-3,1.38732E-3,1.5900700000000001E-3,1.79189E-3,1.9649699999999999E-3,2.1028800000000001E-3,2.17234E-3,2.24398E-3,2.3031499999999999E-3,2.3219600000000001E-3,2.2860900000000002E-3,2.23457E-3,2.1841E-3,2.1198499999999999E-3,1.9669900000000001E-3,1.79035E-3,1.57815E-3,1.39572E-3,1.18957E-3,1.2177799999999999E-3,1.4241099999999999E-3,1.6206E-3,1.7994700000000001E-3,1.9230199999999999E-3,2.0622700000000002E-3,2.1786000000000002E-3,2.2376900000000001E-3,2.2677000000000001E-3,2.2833799999999998E-3,2.2608099999999998E-3,2.2126099999999998E-3,2.0926199999999999E-3,1.9738999999999998E-3,1.80058E-3,1.57489E-3,1.3864599999999999E-3,1.1875500000000001E-3]
[null,null,null,612,1.1720000000000001E-3,1.3599199999999999E-3,1.58625E-3,1.75972E-3,1.9189999999999999E-3,2.0882800000000001E-3,2.12721E-3,2.2241700000000001E-3,2.2801399999999999E-3,2.2741800000000002E-3,2.2653600000000001E-3,2.2270300000000001E-3,2.1581E-3,2.0606000000000001E-3,1.92844E-3,1.7758299999999999E-3,1.55847E-3,1.39343E-3,1.1516300000000001E-3,1.1704599999999999E-3,1.3945100000000001E-3,1.5726399999999999E-3,1.73986E-3,1.9184200000000001E-3,2.05755E-3,2.14314E-3,2.1873399999999999E-3,2.2307E-3,2.2542700000000001E-3,2.2600799999999998E-3,2.18322E-3,2.0996600000000002E-3,1.9459900000000001E-3,1.7695600000000001E-3,1.5661E-3,1.3403899999999999E-3,1.14072E-3]
[null,null,null,613,1.1491400000000001E-3,1.3425500000000001E-3,1.54536E-3,1.73668E-3,1.9088E-3,2.0477400000000002E-3,2.1529000000000001E-3,2.1873299999999999E-3,2.2182700000000001E-3,2.2377E-3,2.2242199999999998E-3,2.2036299999999998E-3,2.1432399999999998E-3,2.0231300000000002E-3,1.9383499999999999E-3,1.7190599999999999E-3,1.5495999999999999E-3,1.3651399999999999E-3,1.16866E-3,1.1616300000000001E-3,1.3803299999999999E-3,1.5646900000000001E-3,1.75657E-3,1.90277E-3,2.0171999999999998E-3,2.1059799999999999E-3,2.16183E-3,2.1960899999999999E-3,2.2530800000000002E-3,2.2424099999999998E-3,2.1460799999999999E-3,2.05229E-3,1.9346299999999999E-3,1.73448E-3,1.56959E-3,1.3286800000000001E-3,1.09753E-3]
[null,null,null,614,1.1204400000000001E-3,1.3251300000000001E-3,1.5177400000000001E-3,1.6933300000000001E-3,1.86319E-3,2.0266400000000001E-3,2.0746800000000002E-3,2.1816000000000001E-3,2.1732700000000001E-3,2.19601E-3,2.19717E-3,2.1755699999999999E-3,2.1158499999999998E-3,2.0155899999999998E-3,1.89949E-3,1.7218999999999999E-3,1.52834E-3,1.3393000000000001E-3,1.1186900000000001E-3,1.14383E-3,1.3584199999999999E-3,1.57223E-3,1.7017899999999999E-3,1.8746399999999999E-3,1.99731E-3,2.0969299999999999E-3,2.1583599999999998E-3,2.1961900000000002E-3,2.2177500000000001E-3,2.19315E-3,2.1212599999999998E-3,2.0351200000000001E-3,1.89898E-3,1.6943399999999999E-3,1.51304E-3,1.3066E-3,1.0884E-3]
[null,null,null,615,1.0877599999999999E-3,1.3109300000000001E-3,1.50132E-3,1.7005900000000001E-3,1.88255E-3,1.9943700000000001E-3,2.0941000000000002E-3,2.1808499999999998E-3,2.2012999999999998E-3,2.1872800000000002E-3,2.2079600000000001E-3,2.16753E-3,2.0938300000000001E-3,1.9872900000000001E-3,1.86298E-3,1.7135500000000001E-3,1.51015E-3,1.3189199999999999E-3,1.12331E-3,1.1569900000000001E-3,1.3568E-3,1.5473500000000001E-3,1.7025499999999999E-3,1.86505E-3,1.9823499999999999E-3,2.0795499999999999E-3,2.1758300000000001E-3,2.2040300000000001E-3,2.1880200000000002E-3,2.1822899999999999E-3,2.13072E-3,2.03155E-3,1.9024700000000001E-3,1.71696E-3,1.50595E-3,1.3097899999999999E-3,1.0926899999999999E-3]
[null,null,null,616,1.09062E-3,1.34447E-3,1.5082100000000001E-3,1.71404E-3,1.8991800000000001E-3,1.9679900000000002E-3,2.1102400000000002E-3,2.2011499999999998E-3,2.2056799999999998E-3,2.2067499999999999E-3,2.2063500000000002E-3,2.1658599999999999E-3,2.1392500000000001E-3,2.0058599999999999E-3,1.8747499999999999E-3,1.7227399999999999E-3,1.5230899999999999E-3,1.3247000000000001E-3,1.14003E-3,1.1622399999999999E-3,1.39723E-3,1.57854E-3,1.71675E-3,1.8894999999999999E-3,2.00365E-3,2.11487E-3,2.1805700000000002E-3,2.19068E-3,2.2212899999999999E-3,2.19017E-3,2.1141200000000001E-3,2.02403E-3,1.90127E-3,1.7424000000000001E-3,1.52479E-3,1.3038699999999999E-3,1.1170500000000001E-3]
[null,null,null,617,1.10077E-3,1.2569300000000001E-3,1.4958300000000001E-3,1.6744399999999999E-3,1.85674E-3,1.9591399999999998E-3,2.0832200000000002E-3,2.1276899999999998E-3,2.12444E-3,2.1787400000000002E-3,2.1887500000000002E-3,2.15059E-3,2.12057E-3,1.9381999999999999E-3,1.83263E-3,1.6779500000000001E-3,1.50526E-3,1.31226E-3,1.0790699999999999E-3,1.14361E-3,1.36265E-3,1.52209E-3,1.6917900000000001E-3,1.84267E-3,2.0123799999999998E-3,2.0347299999999998E-3,2.1271900000000002E-3,2.1420599999999999E-3,2.1601900000000002E-3,2.1562600000000001E-3,2.0947600000000002E-3,1.98138E-3,1.8510499999999999E-3,1.7011299999999999E-3,1.5043700000000001E-3,1.2692000000000001E-3,1.0771800000000001E-3]
[null,null,null,618,1.1621400000000001E-3,1.3727500000000001E-3,1.5678000000000001E-3,1.77261E-3,1.8663200000000001E-3,2.0135800000000001E-3,2.1281999999999998E-3,2.1538199999999999E-3,2.25786E-3,2.2085500000000001E-3,2.2227700000000002E-3,2.21871E-3,2.1377100000000001E-3,2.0489699999999998E-3,1.91406E-3,1.76526E-3,1.5782999999999999E-3,1.3707400000000001E-3,1.17913E-3,1.1847400000000001E-3,1.3787999999999999E-3,1.5619799999999999E-3,1.7653300000000001E-3,1.9146300000000001E-3,2.0482E-3,2.11422E-3,2.19768E-3,2.2100700000000002E-3,2.2343100000000002E-3,2.20871E-3,2.1422500000000001E-3,2.04046E-3,1.94393E-3,1.7490299999999999E-3,1.5534500000000001E-3,1.3810700000000001E-3,1.1441000000000001E-3]
[null,null,null,619,1.0761200000000001E-3,1.26385E-3,1.45389E-3,1.6326400000000001E-3,1.82621E-3,1.91892E-3,2.0331500000000001E-3,2.0905799999999999E-3,2.1183500000000002E-3,2.1122799999999998E-3,2.12306E-3,2.0973599999999999E-3,2.0278200000000001E-3,1.9402E-3,1.8093499999999999E-3,1.66924E-3,1.46495E-3,1.28035E-3,1.07602E-3,1.10224E-3,1.2883300000000001E-3,1.4587199999999999E-3,1.6817799999999999E-3,1.8063899999999999E-3,1.90161E-3,1.9986600000000002E-3,2.0868200000000001E-3,2.0998000000000002E-3,2.14547E-3,2.08158E-3,2.0663299999999999E-3,1.9709300000000001E-3,1.8040300000000001E-3,1.6514100000000001E-3,1.46032E-3,1.27911E-3,1.0439399999999999E-3]
[null,null,null,620,1.07931E-3,1.26008E-3,1.4469999999999999E-3,1.6450900000000001E-3,1.79809E-3,1.9380999999999999E-3,2.0173000000000001E-3,2.0946799999999998E-3,2.1234700000000001E-3,2.1200699999999999E-3,2.1483800000000001E-3,2.1057900000000002E-3,2.0485600000000001E-3,1.94973E-3,1.82299E-3,1.6681199999999999E-3,1.4868399999999999E-3,1.2807700000000001E-3,1.09107E-3,1.1234699999999999E-3,1.30579E-3,1.5052799999999999E-3,1.7043399999999999E-3,1.8242200000000001E-3,1.90811E-3,2.0174500000000001E-3,2.0734E-3,2.11751E-3,2.1508E-3,2.0966000000000001E-3,2.0731500000000002E-3,1.97482E-3,1.8322900000000001E-3,1.6609299999999999E-3,1.48701E-3,1.2717900000000001E-3,1.07157E-3]
[null,null,null,621,1.07664E-3,1.2684700000000001E-3,1.4626299999999999E-3,1.6628000000000001E-3,1.81678E-3,1.9605400000000002E-3,2.0181600000000002E-3,2.0905400000000001E-3,2.1155599999999998E-3,2.13108E-3,2.12773E-3,2.1029899999999999E-3,2.0385099999999999E-3,1.9209100000000001E-3,1.8224700000000001E-3,1.6692199999999999E-3,1.49041E-3,1.2893500000000001E-3,1.09994E-3,1.12958E-3,1.2987400000000001E-3,1.48273E-3,1.65274E-3,1.8211099999999999E-3,1.9039700000000001E-3,2.0065199999999999E-3,2.0800300000000001E-3,2.1236699999999998E-3,2.13736E-3,2.1048999999999998E-3,2.0551200000000001E-3,1.9832700000000001E-3,1.8268500000000001E-3,1.6406000000000001E-3,1.4668000000000001E-3,1.2771900000000001E-3,1.0794699999999999E-3]
[null,null,null,622,1.05795E-3,1.2688599999999999E-3,1.4878599999999999E-3,1.6517700000000001E-3,1.7974499999999999E-3,1.9312000000000001E-3,2.0185300000000002E-3,2.0488099999999999E-3,2.0751900000000002E-3,2.08523E-3,2.0986099999999999E-3,2.07799E-3,1.9939200000000002E-3,1.9184899999999999E-3,1.7890499999999999E-3,1.6537699999999999E-3,1.4912300000000001E-3,1.2548500000000001E-3,1.1099899999999999E-3,1.08446E-3,1.3036499999999999E-3,1.4871800000000001E-3,1.63382E-3,1.7853000000000001E-3,1.8916499999999999E-3,1.9745299999999999E-3,2.0534500000000001E-3,2.0931299999999999E-3,2.1146899999999998E-3,2.0870099999999998E-3,2.0210599999999999E-3,1.95076E-3,1.81788E-3,1.61583E-3,1.4280600000000001E-3,1.2443300000000001E-3,1.0435500000000001E-3]
[null,null,null,623,1.04196E-3,1.23952E-3,1.4309399999999999E-3,1.60542E-3,1.79364E-3,1.9125399999999999E-3,1.9946500000000002E-3,2.0558400000000002E-3,2.0795900000000001E-3,2.0773599999999999E-3,2.1037299999999998E-3,2.0471E-3,1.9625799999999998E-3,1.9182699999999999E-3,1.7579900000000001E-3,1.6143900000000001E-3,1.4392400000000001E-3,1.2735800000000001E-3,1.09457E-3,1.09606E-3,1.3077099999999999E-3,1.4395199999999999E-3,1.64273E-3,1.77691E-3,1.87536E-3,1.98518E-3,2.0171099999999999E-3,2.1132899999999999E-3,2.1027300000000001E-3,2.0859899999999998E-3,2.0043399999999999E-3,1.9200300000000001E-3,1.80349E-3,1.6512E-3,1.4542100000000001E-3,1.2506500000000001E-3,1.0627900000000001E-3]
[null,null,null,624,1.04911E-3,1.22776E-3,1.41956E-3,1.58307E-3,1.7489000000000001E-3,1.8540900000000001E-3,1.9429899999999999E-3,2.0127700000000001E-3,2.0528600000000001E-3,2.0592900000000001E-3,2.06581E-3,2.0027700000000001E-3,1.9304400000000001E-3,1.86819E-3,1.7341500000000001E-3,1.6044200000000001E-3,1.41869E-3,1.24985E-3,1.04352E-3,1.08128E-3,1.27614E-3,1.4197400000000001E-3,1.59654E-3,1.75891E-3,1.85921E-3,1.93969E-3,2.0145499999999999E-3,2.0148399999999999E-3,2.05923E-3,2.04886E-3,1.97876E-3,1.89284E-3,1.7672600000000001E-3,1.6186600000000001E-3,1.4012300000000001E-3,1.2153000000000001E-3,1.016E-3]
[null,null,null,625,1.02344E-3,1.2249800000000001E-3,1.3871000000000001E-3,1.5587299999999999E-3,1.71784E-3,1.8350899999999999E-3,1.9111899999999999E-3,1.99008E-3,2.02907E-3,2.0283800000000002E-3,2.0085200000000002E-3,1.9631399999999999E-3,1.9006100000000001E-3,1.8375399999999999E-3,1.6868300000000001E-3,1.5616600000000001E-3,1.38781E-3,1.21835E-3,1.0080200000000001E-3,1.0475E-3,1.2383400000000001E-3,1.41084E-3,1.5616899999999999E-3,1.70706E-3,1.8296499999999999E-3,1.90825E-3,1.9662299999999998E-3,1.9845000000000002E-3,2.0158699999999999E-3,2.0017699999999999E-3,1.9244399999999999E-3,1.84435E-3,1.7155600000000001E-3,1.57847E-3,1.3872000000000001E-3,1.1863399999999999E-3,1.0118E-3]
[null,null,null,626,1.0271099999999999E-3,1.20093E-3,1.3924300000000001E-3,1.56734E-3,1.6940200000000001E-3,1.82723E-3,1.8827900000000001E-3,1.9793200000000001E-3,2.0145300000000001E-3,2.0104200000000002E-3,1.96225E-3,1.9748600000000002E-3,1.89634E-3,1.8204899999999999E-3,1.69542E-3,1.5472299999999999E-3,1.39696E-3,1.2135099999999999E-3,1.04733E-3,1.03579E-3,1.2449500000000001E-3,1.4048000000000001E-3,1.5609199999999999E-3,1.6984000000000001E-3,1.8226399999999999E-3,1.8928199999999999E-3,1.9358000000000001E-3,1.96181E-3,1.98795E-3,1.9470500000000001E-3,1.9301699999999999E-3,1.85564E-3,1.7063200000000001E-3,1.5560299999999999E-3,1.39244E-3,1.19308E-3,1.0110500000000001E-3]
[null,null,null,627,1.0352E-3,1.1885699999999999E-3,1.33168E-3,1.54061E-3,1.67106E-3,1.8034100000000001E-3,1.86509E-3,1.9425899999999999E-3,1.94213E-3,1.9967100000000001E-3,1.9717300000000001E-3,1.94378E-3,1.9015900000000001E-3,1.80028E-3,1.67706E-3,1.5525199999999999E-3,1.37371E-3,1.20083E-3,1.02823E-3,1.0073300000000001E-3,1.2146800000000001E-3,1.36433E-3,1.5321600000000001E-3,1.68863E-3,1.7963499999999999E-3,1.8799299999999999E-3,1.9501500000000001E-3,1.9597099999999999E-3,1.9609800000000002E-3,1.9633200000000002E-3,1.8934900000000001E-3,1.83438E-3,1.6837600000000001E-3,1.5509E-3,1.38134E-3,1.1719E-3,9.9024500000000006E-4]
[null,null,null,628,9.8399300000000006E-4,1.1843400000000001E-3,1.3616800000000001E-3,1.5438400000000001E-3,1.6519600000000001E-3,1.7834999999999999E-3,1.86462E-3,1.90661E-3,1.97022E-3,1.9536499999999999E-3,1.9546500000000001E-3,1.9385299999999999E-3,1.8494E-3,1.7650599999999999E-3,1.63237E-3,1.4765500000000001E-3,1.35607E-3,1.1700899999999999E-3,1.0146899999999999E-3,1.0167100000000001E-3,1.1904800000000001E-3,1.3720799999999999E-3,1.51917E-3,1.6575100000000001E-3,1.7729499999999999E-3,1.85983E-3,1.9095099999999999E-3,1.9306900000000001E-3,1.9286399999999999E-3,1.94144E-3,1.9014800000000001E-3,1.7713200000000001E-3,1.6726099999999999E-3,1.52907E-3,1.3513100000000001E-3,1.1587100000000001E-3,9.84485E-4]
[null,null,null,629,9.7984599999999993E-4,1.1599E-3,1.32697E-3,1.48598E-3,1.64471E-3,1.7817E-3,1.8348500000000001E-3,1.89163E-3,1.93497E-3,1.9595300000000001E-3,1.9398200000000001E-3,1.9011900000000001E-3,1.8483600000000001E-3,1.75672E-3,1.6327900000000001E-3,1.5133099999999999E-3,1.3375699999999999E-3,1.1616E-3,1.0067100000000001E-3,1.00771E-3,1.1816400000000001E-3,1.3521099999999999E-3,1.5081700000000001E-3,1.6593700000000001E-3,1.74366E-3,1.8415300000000001E-3,1.8946499999999999E-3,1.9612800000000001E-3,1.9464599999999999E-3,1.9061600000000001E-3,1.8404599999999999E-3,1.79569E-3,1.65891E-3,1.5113800000000001E-3,1.35771E-3,1.17668E-3,9.9163300000000001E-4]
[null,null,null,630,9.46626E-4,1.13291E-3,1.3168500000000001E-3,1.47799E-3,1.64236E-3,1.73354E-3,1.78564E-3,1.8559099999999999E-3,1.9058899999999999E-3,1.92238E-3,1.8932700000000001E-3,1.85917E-3,1.8144299999999999E-3,1.72638E-3,1.60366E-3,1.4827099999999999E-3,1.3187800000000001E-3,1.1246800000000001E-3,9.9625400000000002E-4,9.8063600000000001E-4,1.1559599999999999E-3,1.33833E-3,1.48295E-3,1.6016100000000001E-3,1.7156999999999999E-3,1.80609E-3,1.8335599999999999E-3,1.90658E-3,1.8942500000000001E-3,1.8798899999999999E-3,1.8100900000000001E-3,1.75311E-3,1.6217200000000001E-3,1.4885199999999999E-3,1.29831E-3,1.13787E-3,9.4751299999999998E-4]
[null,null,null,631,9.1295500000000002E-4,1.09403E-3,1.2681599999999999E-3,1.42676E-3,1.6059399999999999E-3,1.66344E-3,1.7421800000000001E-3,1.80988E-3,1.8505800000000001E-3,1.86436E-3,1.8565299999999999E-3,1.8138500000000001E-3,1.7368800000000001E-3,1.6913E-3,1.5642799999999999E-3,1.4252799999999999E-3,1.25793E-3,1.10676E-3,9.3542199999999999E-4,9.58711E-4,1.12553E-3,1.2929E-3,1.4511400000000001E-3,1.5701700000000001E-3,1.65055E-3,1.7504199999999999E-3,1.7853400000000001E-3,1.8552200000000001E-3,1.84823E-3,1.8469999999999999E-3,1.75297E-3,1.7101099999999999E-3,1.5638200000000001E-3,1.4352499999999999E-3,1.2704400000000001E-3,1.0862000000000001E-3,9.0255000000000001E-4]
[null,null,null,632,8.7356100000000002E-4,1.02979E-3,1.24041E-3,1.3832499999999999E-3,1.4945500000000001E-3,1.56931E-3,1.6946800000000001E-3,1.7584600000000001E-3,1.7984400000000001E-3,1.79445E-3,1.7882799999999999E-3,1.7613500000000001E-3,1.71463E-3,1.6325599999999999E-3,1.51852E-3,1.40617E-3,1.21255E-3,1.0466200000000001E-3,8.8589099999999998E-4,9.0752499999999995E-4,1.08209E-3,1.2039500000000001E-3,1.38149E-3,1.4760699999999999E-3,1.62218E-3,1.6714900000000001E-3,1.7072000000000001E-3,1.76567E-3,1.79236E-3,1.76881E-3,1.7197499999999999E-3,1.6312099999999999E-3,1.54104E-3,1.4075699999999999E-3,1.2016100000000001E-3,1.0396699999999999E-3,8.5801200000000001E-4]
[null,null,null,633,9.2108900000000004E-4,1.0930899999999999E-3,1.2465499999999999E-3,1.4037800000000001E-3,1.53396E-3,1.6683399999999999E-3,1.73397E-3,1.7600700000000001E-3,1.83135E-3,1.8094299999999999E-3,1.8104200000000001E-3,1.7744E-3,1.7509400000000001E-3,1.64499E-3,1.5563199999999999E-3,1.4106800000000001E-3,1.24445E-3,1.1041899999999999E-3,9.2218200000000001E-4,9.5684800000000005E-4,1.1090799999999999E-3,1.2746599999999999E-3,1.42198E-3,1.5485799999999999E-3,1.6393499999999999E-3,1.73204E-3,1.7916099999999999E-3,1.81982E-3,1.8335599999999999E-3,1.7999299999999999E-3,1.72266E-3,1.6661200000000001E-3,1.5469800000000001E-3,1.4087699999999999E-3,1.25424E-3,1.0811099999999999E-3,9.2921500000000005E-4]
[null,null,null,634,8.9262399999999996E-4,1.0731E-3,1.24344E-3,1.4078000000000001E-3,1.50143E-3,1.62005E-3,1.7062799999999999E-3,1.75863E-3,1.8049699999999999E-3,1.8226900000000001E-3,1.7936499999999999E-3,1.7541099999999999E-3,1.7024200000000001E-3,1.6417599999999999E-3,1.54254E-3,1.39547E-3,1.2442200000000001E-3,1.0680500000000001E-3,9.1909900000000004E-4,9.0653200000000004E-4,1.1049499999999999E-3,1.25998E-3,1.3944700000000001E-3,1.5307999999999999E-3,1.6374499999999999E-3,1.6924399999999999E-3,1.74361E-3,1.7469300000000001E-3,1.7991000000000001E-3,1.78623E-3,1.7291699999999999E-3,1.6398199999999999E-3,1.52955E-3,1.38445E-3,1.2444000000000001E-3,1.0862599999999999E-3,8.9063399999999996E-4]
[null,null,null,635,8.98156E-4,1.06185E-3,1.2266099999999999E-3,1.3696800000000001E-3,1.4878599999999999E-3,1.61886E-3,1.6720299999999999E-3,1.7648200000000001E-3,1.7842999999999999E-3,1.78185E-3,1.80222E-3,1.7450600000000001E-3,1.6786699999999999E-3,1.60071E-3,1.49814E-3,1.35888E-3,1.24128E-3,1.0679299999999999E-3,9.0144800000000001E-4,9.1494000000000005E-4,1.0884600000000001E-3,1.24866E-3,1.3739399999999999E-3,1.48767E-3,1.59823E-3,1.66124E-3,1.7204799999999999E-3,1.7397599999999999E-3,1.7784000000000001E-3,1.74562E-3,1.6984599999999999E-3,1.6236200000000001E-3,1.5148399999999999E-3,1.3675200000000001E-3,1.2056899999999999E-3,1.0554799999999999E-3,8.9992299999999996E-4]
[null,null,null,636,8.4842800000000003E-4,1.00179E-3,1.18878E-3,1.33131E-3,1.4327000000000001E-3,1.5507100000000001E-3,1.6453399999999999E-3,1.70539E-3,1.72905E-3,1.69914E-3,1.7303100000000001E-3,1.64762E-3,1.62926E-3,1.5385900000000001E-3,1.4384199999999999E-3,1.3241800000000001E-3,1.19119E-3,1.01084E-3,8.6504300000000002E-4,8.8436799999999996E-4,1.03174E-3,1.1863399999999999E-3,1.3355800000000001E-3,1.44041E-3,1.5454399999999999E-3,1.6272999999999999E-3,1.66927E-3,1.6699099999999999E-3,1.7112E-3,1.6876700000000001E-3,1.6359199999999999E-3,1.5637699999999999E-3,1.4545599999999999E-3,1.29364E-3,1.1558199999999999E-3,1.00858E-3,8.3990599999999996E-4]
[null,null,null,637,8.5117099999999996E-4,9.6874299999999999E-4,1.1339399999999999E-3,1.2974099999999999E-3,1.42676E-3,1.5240200000000001E-3,1.5931700000000001E-3,1.65131E-3,1.6585199999999999E-3,1.66518E-3,1.6797800000000001E-3,1.6147399999999999E-3,1.6006600000000001E-3,1.51928E-3,1.4123499999999999E-3,1.2683E-3,1.1348599999999999E-3,1.0053799999999999E-3,8.3913100000000001E-4,8.5923499999999997E-4,1.0170299999999999E-3,1.1378200000000001E-3,1.3001499999999999E-3,1.4115099999999999E-3,1.48701E-3,1.57244E-3,1.6232E-3,1.6458600000000001E-3,1.67359E-3,1.6254900000000001E-3,1.5841E-3,1.5159399999999999E-3,1.41303E-3,1.3095800000000001E-3,1.1225199999999999E-3,9.59296E-4,8.2716599999999995E-4]
[null,null,null,638,8.9019800000000003E-4,1.03359E-3,1.2021899999999999E-3,1.35392E-3,1.4733400000000001E-3,1.56087E-3,1.64336E-3,1.6784899999999999E-3,1.7320599999999999E-3,1.6982500000000001E-3,1.7004800000000001E-3,1.68359E-3,1.6484E-3,1.58975E-3,1.4832199999999999E-3,1.35205E-3,1.19081E-3,1.0681499999999999E-3,9.1255199999999996E-4,9.2004800000000002E-4,1.0757799999999999E-3,1.2035100000000001E-3,1.3761699999999999E-3,1.4684399999999999E-3,1.5431500000000001E-3,1.6366499999999999E-3,1.7056300000000001E-3,1.7135399999999999E-3,1.7240999999999999E-3,1.69476E-3,1.6582000000000001E-3,1.6057599999999999E-3,1.50084E-3,1.34E-3,1.1896700000000001E-3,1.04696E-3,8.6296599999999995E-4]
[null,null,null,639,8.2077099999999998E-4,9.5831099999999999E-4,1.13579E-3,1.2849300000000001E-3,1.39869E-3,1.48109E-3,1.5540599999999999E-3,1.60962E-3,1.65982E-3,1.63795E-3,1.6397199999999999E-3,1.6405199999999999E-3,1.56522E-3,1.4939899999999999E-3,1.4001899999999999E-3,1.2624299999999999E-3,1.14226E-3,9.8319199999999992E-4,8.2978700000000002E-4,8.6223599999999995E-4,1.00143E-3,1.1467300000000001E-3,1.28461E-3,1.4048000000000001E-3,1.5086100000000001E-3,1.57346E-3,1.6091499999999999E-3,1.62206E-3,1.6415500000000001E-3,1.62542E-3,1.58628E-3,1.5017100000000001E-3,1.4129800000000001E-3,1.27451E-3,1.1158699999999999E-3,9.7651699999999999E-4,8.19388E-4]
[null,null,null,640,8.1693100000000002E-4,9.8650100000000009E-4,1.11994E-3,1.27479E-3,1.38598E-3,1.4651099999999999E-3,1.5447600000000001E-3,1.5890699999999999E-3,1.61973E-3,1.61918E-3,1.6300900000000001E-3,1.59421E-3,1.5733800000000001E-3,1.4866300000000001E-3,1.3891299999999999E-3,1.25814E-3,1.11634E-3,9.79995E-4,8.3425800000000005E-4,8.6567800000000004E-4,1.00373E-3,1.1404900000000001E-3,1.2648900000000001E-3,1.3946E-3,1.4819900000000001E-3,1.55186E-3,1.58607E-3,1.6294199999999999E-3,1.6392900000000001E-3,1.60476E-3,1.5571300000000001E-3,1.4776800000000001E-3,1.4008899999999999E-3,1.2544100000000001E-3,1.1168599999999999E-3,9.6059100000000001E-4,8.1437100000000004E-4]
[null,null,null,641,7.9603499999999995E-4,9.6808099999999998E-4,1.09037E-3,1.2354600000000001E-3,1.3683E-3,1.4433E-3,1.49479E-3,1.5440899999999999E-3,1.59808E-3,1.5792200000000001E-3,1.59297E-3,1.5608799999999999E-3,1.5106099999999999E-3,1.4405900000000001E-3,1.34476E-3,1.2258900000000001E-3,1.0907499999999999E-3,9.5136600000000004E-4,8.1386700000000002E-4,8.4164899999999998E-4,9.907570000000001E-4,1.0955400000000001E-3,1.2531599999999999E-3,1.33526E-3,1.4309699999999999E-3,1.51239E-3,1.5518299999999999E-3,1.5872099999999999E-3,1.58987E-3,1.5673200000000001E-3,1.53239E-3,1.4704E-3,1.34947E-3,1.22478E-3,1.09387E-3,9.5423999999999997E-4,7.6436400000000002E-4]
[null,null,null,642,7.8159300000000002E-4,9.2662599999999995E-4,1.0945600000000001E-3,1.1834199999999999E-3,1.3360900000000001E-3,1.4264099999999999E-3,1.48901E-3,1.5384999999999999E-3,1.57054E-3,1.5704600000000001E-3,1.58245E-3,1.5357700000000001E-3,1.4958300000000001E-3,1.4434700000000001E-3,1.32175E-3,1.21434E-3,1.0767000000000001E-3,9.4216799999999996E-4,7.8186200000000003E-4,8.0587699999999998E-4,9.3984299999999999E-4,1.0955800000000001E-3,1.19899E-3,1.3515199999999999E-3,1.3830800000000001E-3,1.4544499999999999E-3,1.49866E-3,1.5607799999999999E-3,1.5716599999999999E-3,1.57628E-3,1.49343E-3,1.45083E-3,1.33377E-3,1.20034E-3,1.06854E-3,9.2880100000000004E-4,7.6945099999999999E-4]
[null,null,null,643,7.6563300000000005E-4,9.0851699999999996E-4,1.03837E-3,1.2033600000000001E-3,1.3039200000000001E-3,1.38816E-3,1.446E-3,1.46021E-3,1.5029900000000001E-3,1.54554E-3,1.52579E-3,1.49417E-3,1.44696E-3,1.39701E-3,1.30511E-3,1.1831400000000001E-3,1.04671E-3,9.2543699999999998E-4,7.6003799999999999E-4,7.93979E-4,9.0778099999999997E-4,1.0536499999999999E-3,1.1699600000000001E-3,1.28914E-3,1.3957799999999999E-3,1.4521099999999999E-3,1.4855700000000001E-3,1.48767E-3,1.5281299999999999E-3,1.5301500000000001E-3,1.4530999999999999E-3,1.38064E-3,1.3288200000000001E-3,1.1836800000000001E-3,1.0261700000000001E-3,9.0695599999999999E-4,7.6023900000000001E-4]
[null,null,null,644,7.7307400000000001E-4,8.9483E-4,1.0315700000000001E-3,1.1632999999999999E-3,1.28426E-3,1.3655200000000001E-3,1.4072900000000001E-3,1.4677900000000001E-3,1.4979399999999999E-3,1.5202900000000001E-3,1.53064E-3,1.44144E-3,1.42275E-3,1.3612800000000001E-3,1.2941000000000001E-3,1.1556299999999999E-3,1.0486E-3,9.0513599999999996E-4,7.7119000000000005E-4,7.8310000000000001E-4,8.9918099999999998E-4,1.0441999999999999E-3,1.16876E-3,1.2570299999999999E-3,1.36618E-3,1.4214200000000001E-3,1.4669100000000001E-3,1.4719399999999999E-3,1.50596E-3,1.5041200000000001E-3,1.4594199999999999E-3,1.3575499999999999E-3,1.29886E-3,1.1770999999999999E-3,1.03557E-3,9.0274099999999998E-4,7.7145200000000005E-4]
[null,null,null,645,7.4718899999999999E-4,8.7946499999999996E-4,1.00168E-3,1.13298E-3,1.24708E-3,1.32441E-3,1.39438E-3,1.4552300000000001E-3,1.48547E-3,1.4863999999999999E-3,1.4777900000000001E-3,1.43264E-3,1.3810000000000001E-3,1.3389000000000001E-3,1.2420700000000001E-3,1.14463E-3,1.03006E-3,8.9314899999999998E-4,7.4187700000000005E-4,7.8444699999999997E-4,8.98087E-4,1.01307E-3,1.1562899999999999E-3,1.2564799999999999E-3,1.3283500000000001E-3,1.3849699999999999E-3,1.4285700000000001E-3,1.4488400000000001E-3,1.47003E-3,1.4387099999999999E-3,1.43162E-3,1.34895E-3,1.25187E-3,1.16299E-3,1.00567E-3,8.5538900000000002E-4,7.5226700000000004E-4]
[null,null,null,646,6.8912499999999996E-4,8.2210499999999995E-4,9.3026700000000003E-4,1.0901000000000001E-3,1.18669E-3,1.28743E-3,1.3198000000000001E-3,1.36192E-3,1.39057E-3,1.4167699999999999E-3,1.37933E-3,1.37919E-3,1.3412999999999999E-3,1.2553200000000001E-3,1.1783E-3,1.0828299999999999E-3,9.4005499999999997E-4,8.04907E-4,6.7867100000000005E-4,7.0026500000000005E-4,8.2576299999999997E-4,9.5518399999999998E-4,1.0632199999999999E-3,1.17249E-3,1.24726E-3,1.3219200000000001E-3,1.3774900000000001E-3,1.3767E-3,1.4099099999999999E-3,1.3979400000000001E-3,1.3445499999999999E-3,1.2805399999999999E-3,1.1911199999999999E-3,1.08157E-3,9.54834E-4,8.2749099999999997E-4,6.91145E-4]
[null,null,null,647,6.6421799999999995E-4,7.7694600000000004E-4,9.2608899999999995E-4,1.04046E-3,1.14543E-3,1.2095299999999999E-3,1.29897E-3,1.35052E-3,1.3568499999999999E-3,1.3927900000000001E-3,1.3588599999999999E-3,1.33808E-3,1.2994700000000001E-3,1.2456399999999999E-3,1.1689000000000001E-3,1.07325E-3,9.0995099999999999E-4,8.0452200000000001E-4,6.7109600000000004E-4,7.0127500000000001E-4,8.1137600000000005E-4,9.1884599999999996E-4,1.06317E-3,1.1204100000000001E-3,1.23138E-3,1.2787300000000001E-3,1.33103E-3,1.33034E-3,1.3691199999999999E-3,1.3482100000000001E-3,1.3219900000000001E-3,1.22909E-3,1.13378E-3,1.0264300000000001E-3,9.1151100000000005E-4,8.03048E-4,6.3711599999999996E-4]
[null,null,null,648,6.8922600000000003E-4,8.0557100000000004E-4,9.5287200000000001E-4,1.08646E-3,1.16215E-3,1.2492099999999999E-3,1.31941E-3,1.3756599999999999E-3,1.38598E-3,1.40373E-3,1.37656E-3,1.3312300000000001E-3,1.2985399999999999E-3,1.2855E-3,1.18088E-3,1.05203E-3,9.7338100000000005E-4,8.1381599999999998E-4,7.3115099999999998E-4,7.0205400000000002E-4,8.2874999999999995E-4,9.4012200000000005E-4,1.0798800000000001E-3,1.1994499999999999E-3,1.24788E-3,1.28871E-3,1.32727E-3,1.37273E-3,1.3614E-3,1.3631299999999999E-3,1.3205300000000001E-3,1.2460500000000001E-3,1.1844799999999999E-3,1.0782400000000001E-3,9.4838799999999999E-4,8.0541E-4,6.8237899999999999E-4]
[null,null,null,649,6.3828400000000003E-4,7.6629900000000002E-4,8.7837600000000005E-4,9.9298300000000002E-4,1.1115700000000001E-3,1.1634799999999999E-3,1.2192100000000001E-3,1.2910899999999999E-3,1.2841899999999999E-3,1.3206100000000001E-3,1.2872599999999999E-3,1.2592199999999999E-3,1.2234800000000001E-3,1.18475E-3,1.1026E-3,9.8482699999999997E-4,8.7631199999999997E-4,7.3800299999999999E-4,6.42386E-4,6.5399399999999997E-4,7.6462000000000003E-4,8.7910099999999997E-4,9.8736900000000009E-4,1.0877E-3,1.1648800000000001E-3,1.2276699999999999E-3,1.2621399999999999E-3,1.28399E-3,1.2948600000000001E-3,1.26479E-3,1.2525100000000001E-3,1.17395E-3,1.10198E-3,9.9146999999999994E-4,8.95794E-4,7.3161000000000005E-4,6.2343000000000001E-4]
[null,null,null,650,6.6642199999999996E-4,7.7518699999999999E-4,8.8099000000000001E-4,1.0157600000000001E-3,1.09779E-3,1.16821E-3,1.2569199999999999E-3,1.29878E-3,1.3125000000000001E-3,1.31606E-3,1.31667E-3,1.28356E-3,1.24913E-3,1.1912400000000001E-3,1.12353E-3,1.0177700000000001E-3,9.1707099999999999E-4,7.7422299999999999E-4,6.7326799999999998E-4,6.60606E-4,8.0792899999999998E-4,9.1879600000000004E-4,1.0223999999999999E-3,1.10692E-3,1.1925900000000001E-3,1.255E-3,1.26151E-3,1.3189600000000001E-3,1.29093E-3,1.27739E-3,1.26228E-3,1.2017900000000001E-3,1.09969E-3,1.00723E-3,9.1515399999999995E-4,7.6998500000000005E-4,6.6116899999999997E-4]
[null,null,null,651,6.20496E-4,7.5811800000000001E-4,8.8017399999999995E-4,1.00274E-3,1.06931E-3,1.16281E-3,1.19892E-3,1.27651E-3,1.2870399999999999E-3,1.2871899999999999E-3,1.25709E-3,1.2664499999999999E-3,1.2288100000000001E-3,1.14628E-3,1.10614E-3,9.7382100000000004E-4,8.7270499999999999E-4,7.5233600000000004E-4,6.4211400000000005E-4,6.5302299999999997E-4,7.8955599999999996E-4,8.9285199999999997E-4,9.8393900000000008E-4,1.0628600000000001E-3,1.15686E-3,1.19089E-3,1.2216200000000001E-3,1.2799E-3,1.2921600000000001E-3,1.25925E-3,1.21685E-3,1.1751999999999999E-3,1.0836699999999999E-3,9.8821600000000009E-4,8.7575399999999996E-4,7.4670599999999998E-4,6.1733000000000003E-4]
[null,null,null,652,6.2527199999999996E-4,7.5044399999999996E-4,8.47159E-4,9.6643599999999999E-4,1.0994500000000001E-3,1.1457500000000001E-3,1.19615E-3,1.2381499999999999E-3,1.2436599999999999E-3,1.2596E-3,1.25472E-3,1.23807E-3,1.1979600000000001E-3,1.14646E-3,1.0613199999999999E-3,9.7337599999999997E-4,8.5373399999999998E-4,7.5558899999999998E-4,6.4483699999999999E-4,6.6093399999999996E-4,7.5617900000000005E-4,8.6812100000000002E-4,9.9159199999999991E-4,1.05981E-3,1.16354E-3,1.19747E-3,1.21612E-3,1.2540800000000001E-3,1.27841E-3,1.23992E-3,1.2052300000000001E-3,1.1474300000000001E-3,1.1000700000000001E-3,9.8681300000000001E-4,8.6613300000000005E-4,7.7184300000000003E-4,6.2298799999999999E-4]
[null,null,null,653,6.0723999999999999E-4,7.24452E-4,8.2740299999999999E-4,9.4562300000000004E-4,1.0432900000000001E-3,1.11848E-3,1.1591100000000001E-3,1.2162E-3,1.2095299999999999E-3,1.2127100000000001E-3,1.2287000000000001E-3,1.20064E-3,1.1549900000000001E-3,1.1209499999999999E-3,1.03841E-3,9.3883499999999995E-4,8.38001E-4,7.4580100000000004E-4,6.2038100000000004E-4,6.3403199999999998E-4,7.4938000000000001E-4,8.4832799999999997E-4,9.5443100000000005E-4,1.04067E-3,1.10491E-3,1.1481200000000001E-3,1.17574E-3,1.19093E-3,1.2300799999999999E-3,1.22839E-3,1.17679E-3,1.13123E-3,1.0497499999999999E-3,9.3907099999999998E-4,8.4448499999999996E-4,7.2220699999999999E-4,6.1762199999999996E-4]
[null,null,null,654,5.9896500000000002E-4,7.1886599999999997E-4,8.0562699999999995E-4,9.1175700000000002E-4,1.0341899999999999E-3,1.0769899999999999E-3,1.1312E-3,1.1685199999999999E-3,1.1818E-3,1.1932399999999999E-3,1.16829E-3,1.14785E-3,1.12257E-3,1.08182E-3,1.0125100000000001E-3,9.2764200000000001E-4,8.1089900000000002E-4,7.0820699999999998E-4,5.81907E-4,6.1788700000000002E-4,7.2871700000000004E-4,8.3890099999999997E-4,9.1750700000000002E-4,1.0091E-3,1.0879500000000001E-3,1.1211699999999999E-3,1.15675E-3,1.1640999999999999E-3,1.21367E-3,1.18468E-3,1.14266E-3,1.0940500000000001E-3,1.0299300000000001E-3,9.11184E-4,8.2446600000000004E-4,6.9009500000000005E-4,5.9865799999999996E-4]
[null,null,null,655,5.8249199999999999E-4,7.0068099999999998E-4,7.9688299999999997E-4,8.8062999999999998E-4,1.0007799999999999E-3,1.07985E-3,1.10322E-3,1.13452E-3,1.1621699999999999E-3,1.1782400000000001E-3,1.1371700000000001E-3,1.14061E-3,1.1211299999999999E-3,1.0591800000000001E-3,9.9829999999999993E-4,9.1160700000000004E-4,8.0314199999999996E-4,7.08236E-4,5.9585900000000002E-4,6.1250699999999998E-4,7.1172499999999997E-4,8.1065900000000003E-4,8.8831800000000003E-4,9.9156900000000009E-4,1.0463E-3,1.10669E-3,1.12707E-3,1.1545800000000001E-3,1.18727E-3,1.15952E-3,1.1548299999999999E-3,1.0842899999999999E-3,9.9324599999999993E-4,9.06674E-4,7.8786700000000004E-4,6.6441500000000001E-4,5.9278499999999997E-4]
[null,null,null,656,5.6422000000000004E-4,6.3720599999999997E-4,7.7496499999999996E-4,8.6864799999999997E-4,9.5363200000000005E-4,1.0380000000000001E-3,1.0575300000000001E-3,1.1045199999999999E-3,1.1247E-3,1.12633E-3,1.12633E-3,1.0765200000000001E-3,1.0683699999999999E-3,1.01767E-3,9.6112699999999999E-4,8.5352400000000004E-4,7.6561000000000001E-4,6.6136799999999996E-4,5.6687000000000003E-4,5.8616400000000002E-4,6.8294099999999995E-4,7.6760999999999995E-4,8.8069600000000004E-4,9.5613700000000002E-4,9.984499999999999E-4,1.0428499999999999E-3,1.0838200000000001E-3,1.10603E-3,1.1020299999999999E-3,1.1031700000000001E-3,1.0780099999999999E-3,1.03246E-3,9.4568199999999999E-4,8.5193200000000001E-4,7.5167099999999998E-4,6.5105299999999996E-4,5.3569299999999995E-4]
[null,null,null,657,5.66221E-4,6.4032200000000003E-4,7.5049299999999997E-4,8.50072E-4,9.18938E-4,9.9310200000000005E-4,1.0466900000000001E-3,1.0870700000000001E-3,1.1175600000000001E-3,1.1186600000000001E-3,1.0997400000000001E-3,1.07748E-3,1.0522699999999999E-3,1.0036999999999999E-3,9.4285699999999996E-4,8.5361400000000004E-4,7.6658399999999995E-4,6.6556099999999995E-4,5.5787000000000002E-4,5.5931700000000004E-4,6.9453799999999997E-4,7.5349200000000003E-4,8.2699900000000003E-4,9.4587299999999996E-4,9.9160599999999991E-4,1.0507800000000001E-3,1.09103E-3,1.07968E-3,1.0964200000000001E-3,1.08899E-3,1.0572800000000001E-3,9.8337300000000006E-4,9.49952E-4,8.4438999999999998E-4,7.5634300000000003E-4,6.4406700000000001E-4,5.4777700000000005E-4]
[null,null,null,658,5.4157999999999995E-4,6.3420399999999997E-4,7.3572399999999999E-4,8.1977999999999999E-4,9.0316099999999998E-4,9.7552700000000001E-4,1.0292400000000001E-3,1.05299E-3,1.0901299999999999E-3,1.1041200000000001E-3,1.07913E-3,1.0685899999999999E-3,1.0263799999999999E-3,9.8340600000000004E-4,8.92138E-4,8.3747800000000001E-4,7.5288199999999997E-4,6.6270000000000001E-4,5.4168100000000002E-4,5.6053500000000003E-4,6.6502399999999995E-4,7.5938799999999995E-4,8.2475400000000003E-4,9.2646600000000003E-4,9.6849499999999999E-4,1.0276899999999999E-3,1.04038E-3,1.0783800000000001E-3,1.07927E-3,1.0765900000000001E-3,1.03129E-3,1.0147000000000001E-3,9.1070699999999997E-4,8.6051900000000002E-4,7.2434699999999997E-4,6.4165200000000004E-4,5.2617500000000004E-4]
[null,null,null,659,5.40881E-4,6.19201E-4,7.4096999999999998E-4,8.2708499999999997E-4,9.1963500000000003E-4,9.8763299999999991E-4,1.04173E-3,1.03921E-3,1.0709300000000001E-3,1.0918099999999999E-3,1.06237E-3,1.0633999999999999E-3,1.0221900000000001E-3,9.7719400000000002E-4,8.8934699999999997E-4,8.2519699999999995E-4,7.5170100000000002E-4,6.53734E-4,5.5560600000000005E-4,5.6001499999999997E-4,6.6309400000000003E-4,7.5916999999999998E-4,8.3046699999999999E-4,9.1421000000000004E-4,9.7605499999999998E-4,1.0041200000000001E-3,1.0503699999999999E-3,1.05876E-3,1.0737800000000001E-3,1.0612799999999999E-3,1.0326599999999999E-3,9.8835200000000007E-4,9.1580100000000005E-4,8.2600999999999996E-4,7.1210399999999997E-4,6.4444700000000003E-4,5.2832599999999997E-4]
[null,null,null,660,4.9404199999999998E-4,5.82809E-4,6.6467000000000002E-4,7.9119300000000004E-4,8.4751200000000003E-4,9.3927500000000005E-4,9.6900600000000001E-4,9.8248799999999989E-4,1.02154E-3,1.02575E-3,1.01074E-3,9.8294000000000007E-4,9.7754500000000002E-4,9.3756700000000004E-4,8.5588299999999999E-4,7.5599300000000005E-4,6.85664E-4,6.0778000000000004E-4,4.9170599999999996E-4,4.97183E-4,5.9315400000000003E-4,6.7601499999999997E-4,7.8003399999999998E-4,8.4084199999999996E-4,9.1448799999999998E-4,9.6506000000000001E-4,9.6860000000000002E-4,9.9698400000000002E-4,1.0185000000000001E-3,1.01337E-3,9.7293100000000001E-4,9.2309599999999999E-4,8.7463000000000005E-4,7.6313399999999995E-4,6.6225400000000003E-4,5.7824299999999999E-4,4.8452599999999999E-4]
[null,null,null,661,5.37796E-4,6.5829300000000001E-4,7.3582200000000002E-4,8.1541100000000004E-4,9.0017099999999996E-4,9.7012300000000004E-4,9.850830000000001E-4,1.04864E-3,1.08052E-3,1.05371E-3,1.07464E-3,1.0431500000000001E-3,9.933539999999999E-4,9.65101E-4,8.9525900000000003E-4,8.1020699999999996E-4,7.2824299999999995E-4,6.2996899999999997E-4,5.4808799999999996E-4,5.84586E-4,6.6158000000000005E-4,7.4220799999999995E-4,8.2563199999999997E-4,9.2542099999999995E-4,9.5281599999999999E-4,1.0065499999999999E-3,1.0673E-3,1.0321E-3,1.0332900000000001E-3,1.0903200000000001E-3,1.01468E-3,9.8490399999999999E-4,9.0499000000000005E-4,8.1248900000000001E-4,7.2230899999999997E-4,6.3491999999999997E-4,5.6995500000000003E-4]
[null,null,null,662,4.68493E-4,5.62441E-4,6.51675E-4,7.4100299999999995E-4,8.3427600000000001E-4,8.8346799999999999E-4,9.2218499999999995E-4,9.44326E-4,9.8974799999999993E-4,9.4680199999999995E-4,9.8682900000000005E-4,9.4038800000000001E-4,9.2644799999999996E-4,8.7216500000000005E-4,8.1627200000000005E-4,7.4916100000000003E-4,6.78124E-4,5.7673000000000002E-4,4.9107600000000001E-4,4.8640400000000001E-4,5.94963E-4,6.6827599999999998E-4,7.6867299999999999E-4,8.2508600000000005E-4,8.6126400000000004E-4,8.9860999999999999E-4,9.4400199999999999E-4,9.3644300000000002E-4,9.6425799999999996E-4,9.5537599999999997E-4,9.1531499999999999E-4,8.9122699999999997E-4,8.2458599999999998E-4,7.2625100000000002E-4,6.6390100000000005E-4,5.8865399999999998E-4,4.8317599999999998E-4]
[null,null,null,663,4.8441100000000002E-4,5.7225400000000001E-4,6.51455E-4,7.7145700000000002E-4,8.2831199999999999E-4,8.7812100000000004E-4,9.2310199999999997E-4,9.5448199999999999E-4,9.7511799999999997E-4,9.7909699999999995E-4,9.6326099999999998E-4,9.63111E-4,9.2413300000000005E-4,8.8196900000000003E-4,8.1263699999999995E-4,7.4458200000000003E-4,6.69957E-4,5.9685999999999995E-4,4.8576499999999998E-4,5.0561699999999998E-4,5.9435900000000003E-4,6.8209200000000003E-4,7.3742700000000003E-4,8.1384600000000001E-4,8.9237400000000003E-4,9.2426800000000001E-4,9.49119E-4,9.6398499999999999E-4,9.6327999999999995E-4,9.5672699999999999E-4,9.4399700000000002E-4,8.7339299999999998E-4,8.1535799999999997E-4,7.4739399999999997E-4,6.6026799999999999E-4,5.6652199999999997E-4,4.7054799999999999E-4]
[null,null,null,664,4.5494399999999999E-4,5.4770899999999996E-4,6.2560199999999995E-4,7.1362400000000005E-4,7.7742000000000002E-4,8.3458000000000002E-4,8.8858000000000003E-4,9.0960800000000001E-4,9.2598300000000001E-4,9.4188500000000005E-4,9.2732000000000003E-4,8.99389E-4,8.7609099999999996E-4,8.2474200000000005E-4,7.8878300000000004E-4,7.0100499999999999E-4,6.3939200000000002E-4,5.5785100000000005E-4,4.4536000000000001E-4,4.5431099999999999E-4,5.4423199999999996E-4,6.2912899999999997E-4,6.9564900000000001E-4,7.74196E-4,8.3922700000000001E-4,8.6202399999999997E-4,9.1462200000000003E-4,9.1615000000000002E-4,9.1790199999999995E-4,9.2522100000000005E-4,8.9955299999999998E-4,8.3402400000000005E-4,7.9067600000000003E-4,7.3348200000000004E-4,6.3757699999999996E-4,5.4624800000000005E-4,4.43425E-4]
[null,null,null,665,4.6401100000000001E-4,5.5380399999999997E-4,6.3831000000000001E-4,7.2942099999999995E-4,7.7290599999999996E-4,8.3120299999999998E-4,8.9194800000000005E-4,8.9539100000000005E-4,9.1025399999999999E-4,9.1244000000000004E-4,9.1271799999999997E-4,9.09497E-4,8.9341099999999999E-4,8.4329700000000001E-4,7.6761500000000003E-4,6.9555099999999998E-4,6.3278900000000003E-4,5.5460500000000001E-4,4.7530100000000002E-4,4.5618399999999999E-4,5.8010400000000001E-4,6.4641299999999998E-4,7.1322699999999998E-4,7.7416799999999999E-4,8.3976600000000004E-4,8.75419E-4,9.2167300000000002E-4,9.0729700000000005E-4,9.50861E-4,9.0670900000000001E-4,9.0048600000000004E-4,8.3873699999999999E-4,7.9266999999999998E-4,7.2663299999999997E-4,6.2766500000000002E-4,5.4282699999999996E-4,4.6988500000000002E-4]
[null,null,null,666,4.5882799999999999E-4,5.3829300000000002E-4,6.4706699999999998E-4,6.97783E-4,7.6580099999999998E-4,8.1764800000000003E-4,8.7143599999999996E-4,8.8718399999999995E-4,9.0437600000000003E-4,8.9532700000000002E-4,9.3000600000000004E-4,8.6418699999999998E-4,8.81093E-4,8.1478099999999999E-4,7.6354799999999996E-4,6.9970700000000004E-4,6.3506000000000001E-4,5.4372600000000002E-4,4.6475100000000001E-4,4.8693599999999999E-4,5.8680899999999999E-4,6.3593299999999998E-4,7.3204599999999998E-4,7.5865600000000002E-4,8.3691899999999999E-4,8.6408999999999998E-4,8.7514299999999999E-4,9.3066100000000005E-4,8.9944299999999999E-4,9.0015899999999999E-4,8.8738599999999999E-4,8.2310800000000002E-4,7.8131399999999997E-4,7.23977E-4,6.4654000000000003E-4,5.3681200000000001E-4,4.4694500000000002E-4]
[null,null,null,667,4.4166399999999998E-4,5.25808E-4,6.0706099999999999E-4,6.7585400000000004E-4,7.3461299999999995E-4,8.0578400000000004E-4,8.3275999999999999E-4,8.4287499999999998E-4,8.7674900000000002E-4,8.7147799999999997E-4,8.7519300000000002E-4,8.2964599999999996E-4,8.2804500000000002E-4,7.7866399999999998E-4,7.4044200000000001E-4,6.7589099999999997E-4,6.0199899999999998E-4,5.2570299999999998E-4,4.4904199999999997E-4,4.43001E-4,5.2771600000000001E-4,6.0804999999999995E-4,6.5835399999999999E-4,7.3539899999999997E-4,7.9999599999999998E-4,8.1481499999999998E-4,8.5121399999999999E-4,8.8371000000000001E-4,8.8007000000000005E-4,8.7396299999999995E-4,8.4505500000000005E-4,7.9163400000000004E-4,7.5527500000000002E-4,6.7331699999999999E-4,5.8996899999999998E-4,5.24809E-4,4.1628900000000003E-4]
[null,null,null,668,4.16635E-4,5.1020899999999997E-4,5.8460700000000001E-4,6.6779399999999998E-4,7.1573299999999997E-4,7.8125999999999998E-4,8.0858600000000003E-4,8.1675699999999999E-4,8.4246500000000003E-4,8.5468700000000002E-4,8.4859099999999999E-4,8.33305E-4,7.9945400000000001E-4,7.5936999999999999E-4,7.0577599999999997E-4,6.61178E-4,5.7094000000000003E-4,5.1902000000000003E-4,4.2057599999999998E-4,4.1500800000000002E-4,5.1838899999999996E-4,5.7886099999999996E-4,6.4868200000000003E-4,7.2016699999999996E-4,7.6854600000000005E-4,7.9228899999999995E-4,8.1983999999999996E-4,8.5352599999999996E-4,8.4424900000000004E-4,8.34923E-4,8.1974299999999995E-4,7.7322100000000004E-4,7.1207200000000001E-4,6.6000599999999998E-4,5.6498099999999999E-4,5.03442E-4,4.0985799999999998E-4]
[null,null,null,669,3.9062500000000002E-4,4.8121399999999999E-4,5.4633199999999996E-4,6.1870399999999998E-4,6.9515199999999999E-4,7.3891099999999997E-4,7.8355700000000005E-4,7.9061099999999998E-4,8.0037299999999995E-4,8.0965699999999998E-4,8.2136000000000004E-4,7.8553800000000001E-4,7.5956500000000002E-4,7.3897800000000005E-4,6.7442299999999995E-4,6.2202000000000004E-4,5.6201799999999996E-4,4.8334700000000002E-4,3.89739E-4,3.77833E-4,4.7270299999999999E-4,5.4991399999999998E-4,6.2051599999999999E-4,6.76079E-4,7.4419000000000004E-4,7.7541800000000005E-4,7.7302399999999998E-4,8.0275599999999996E-4,8.1221400000000001E-4,7.9713899999999999E-4,7.7541199999999995E-4,7.3777100000000002E-4,6.7776900000000005E-4,6.3435399999999995E-4,5.3709700000000005E-4,4.5728799999999998E-4,3.9502299999999999E-4]
[null,null,null,670,3.9437000000000001E-4,4.56222E-4,5.4306099999999996E-4,5.9398399999999998E-4,6.6235399999999998E-4,7.1712900000000005E-4,7.6130499999999999E-4,7.8290900000000004E-4,7.8879999999999998E-4,8.0356199999999996E-4,7.6581200000000005E-4,7.68033E-4,7.6451100000000005E-4,7.2336600000000003E-4,6.6403600000000001E-4,6.05581E-4,5.5040799999999995E-4,4.7431099999999999E-4,3.9527399999999998E-4,3.8503799999999998E-4,4.70824E-4,5.4350799999999995E-4,6.0972100000000003E-4,6.9011699999999997E-4,7.1279399999999999E-4,7.6572100000000002E-4,7.6499700000000001E-4,7.8622200000000005E-4,7.9804799999999999E-4,7.7741599999999996E-4,7.7675599999999997E-4,7.3068999999999999E-4,6.7333499999999995E-4,5.9297699999999996E-4,5.3155200000000002E-4,4.5311800000000002E-4,3.7995200000000002E-4]
[null,null,null,671,4.0329599999999998E-4,4.5772400000000001E-4,5.3420400000000004E-4,6.0508100000000004E-4,6.6782699999999996E-4,7.0720199999999998E-4,7.2874500000000004E-4,7.5189500000000004E-4,7.8398300000000003E-4,7.9976500000000002E-4,7.6357599999999997E-4,7.6319099999999998E-4,7.2835100000000002E-4,7.2305199999999996E-4,6.6386600000000004E-4,5.7353500000000002E-4,5.34656E-4,4.60705E-4,4.1268499999999998E-4,3.8293499999999999E-4,4.6516299999999999E-4,5.4959599999999996E-4,6.0765700000000005E-4,6.7355699999999998E-4,6.9712500000000004E-4,7.4241800000000001E-4,7.5586999999999996E-4,7.7508799999999995E-4,7.8335600000000003E-4,7.7114600000000001E-4,7.3537600000000004E-4,6.8884700000000003E-4,6.53734E-4,5.8076899999999997E-4,5.31599E-4,4.5146200000000002E-4,3.7041599999999999E-4]
[null,null,null,672,3.7130000000000003E-4,4.3669200000000003E-4,5.0649899999999999E-4,5.7271600000000002E-4,6.2989899999999995E-4,6.8145399999999996E-4,7.1237000000000004E-4,7.3359399999999996E-4,7.4441199999999996E-4,7.4810000000000002E-4,7.49627E-4,7.3930600000000001E-4,7.1374899999999996E-4,6.7768500000000003E-4,6.3164299999999998E-4,5.7981999999999999E-4,5.0527000000000005E-4,4.45346E-4,3.7403799999999999E-4,3.89656E-4,4.4537800000000002E-4,5.2913799999999996E-4,5.7061500000000001E-4,6.3073199999999995E-4,6.8822499999999999E-4,6.9364100000000005E-4,7.4041500000000002E-4,7.4452199999999996E-4,7.4723499999999996E-4,7.3063900000000005E-4,7.2966700000000003E-4,6.7699700000000004E-4,6.2594099999999998E-4,5.8542900000000005E-4,5.0613299999999997E-4,4.17775E-4,3.5263100000000001E-4]
[null,null,null,673,3.7943699999999999E-4,4.5761400000000001E-4,5.2767799999999996E-4,5.9942800000000005E-4,6.6105600000000004E-4,7.18868E-4,7.3159699999999995E-4,7.4316599999999997E-4,7.5385199999999995E-4,7.7710699999999997E-4,7.6712799999999995E-4,7.6085699999999998E-4,7.3354799999999999E-4,7.0478700000000001E-4,6.4618300000000004E-4,6.0949400000000003E-4,5.2439100000000003E-4,4.6939099999999999E-4,3.8446999999999998E-4,3.9837199999999997E-4,4.68269E-4,5.4732200000000004E-4,5.8974600000000004E-4,6.4574100000000002E-4,6.9898499999999995E-4,7.2424800000000004E-4,7.4479799999999997E-4,7.6330699999999996E-4,7.8393099999999997E-4,7.6943499999999995E-4,7.3527599999999999E-4,6.9094800000000004E-4,6.5938200000000002E-4,5.96161E-4,5.2767199999999997E-4,4.5721599999999998E-4,3.8901300000000001E-4]
[null,null,null,674,3.6584900000000001E-4,4.2108899999999998E-4,4.9252300000000003E-4,5.6024199999999997E-4,6.3330299999999999E-4,6.7917400000000005E-4,7.0829499999999995E-4,7.2143499999999998E-4,7.3913500000000003E-4,7.3994700000000002E-4,7.3387599999999995E-4,7.2346200000000002E-4,6.8670199999999997E-4,6.6022900000000002E-4,5.94715E-4,5.6298999999999997E-4,4.9841999999999996E-4,4.4361599999999998E-4,3.52431E-4,3.7552400000000002E-4,4.31867E-4,5.0365900000000005E-4,5.8219299999999995E-4,6.3524499999999999E-4,6.75342E-4,6.8785899999999997E-4,7.1564100000000004E-4,7.3363900000000001E-4,7.2948100000000003E-4,7.3307199999999998E-4,6.9667100000000005E-4,6.6484200000000002E-4,6.2206399999999997E-4,5.6570100000000005E-4,4.9435699999999996E-4,4.3015499999999999E-4,3.6390400000000002E-4]
[null,null,null,675,3.26068E-4,4.1166500000000002E-4,4.56291E-4,5.2404700000000003E-4,5.9692800000000004E-4,6.2436499999999999E-4,6.3775599999999996E-4,6.5461200000000005E-4,7.1112200000000001E-4,7.0335600000000003E-4,6.7675400000000001E-4,6.70804E-4,6.5361200000000003E-4,6.3229099999999999E-4,5.8783200000000005E-4,5.1016899999999999E-4,4.8404999999999998E-4,3.9911299999999999E-4,3.1251500000000003E-4,3.61097E-4,3.8308299999999999E-4,4.47701E-4,5.4487299999999997E-4,5.85529E-4,6.0453899999999997E-4,6.4386399999999996E-4,6.6931499999999997E-4,6.80885E-4,7.0566499999999996E-4,6.79067E-4,6.5724999999999996E-4,6.2072799999999997E-4,5.7131499999999997E-4,5.1314500000000001E-4,4.4935299999999999E-4,3.9084900000000002E-4,3.3845799999999998E-4]
[null,null,null,676,3.2220600000000001E-4,3.70665E-4,4.5335599999999997E-4,5.0247400000000004E-4,5.6407199999999999E-4,5.9775400000000004E-4,6.1183199999999998E-4,6.4034400000000005E-4,6.5805799999999999E-4,6.6738400000000003E-4,6.7210499999999999E-4,6.4700700000000001E-4,6.3748500000000003E-4,5.9919499999999996E-4,5.6909300000000001E-4,5.1121900000000004E-4,4.4740300000000003E-4,3.8865500000000001E-4,3.2520200000000002E-4,3.3181299999999998E-4,4.0768999999999999E-4,4.4966199999999998E-4,5.0223900000000003E-4,5.6434200000000001E-4,6.08273E-4,6.2270499999999998E-4,6.4086199999999996E-4,6.6951200000000004E-4,6.8106999999999998E-4,6.5092700000000004E-4,6.6102999999999995E-4,5.9598799999999999E-4,5.6106799999999996E-4,5.0567899999999998E-4,4.4297199999999997E-4,3.8192E-4,3.1533700000000001E-4]
[null,null,null,677,3.4834500000000001E-4,4.0095099999999998E-4,4.8267200000000002E-4,5.2480199999999999E-4,5.7347799999999999E-4,6.1853600000000004E-4,6.4147800000000001E-4,6.6822300000000002E-4,6.7456099999999995E-4,6.8121299999999996E-4,6.7713500000000004E-4,6.5968500000000002E-4,6.3881799999999998E-4,6.2904400000000004E-4,5.8568499999999996E-4,5.1166899999999997E-4,4.71426E-4,4.3160600000000001E-4,3.5519300000000001E-4,3.5639200000000003E-4,4.18439E-4,4.5646800000000002E-4,5.4513200000000004E-4,5.7064500000000005E-4,6.0176000000000001E-4,6.4025400000000004E-4,6.5892499999999998E-4,6.7553299999999997E-4,6.6916899999999995E-4,6.8225700000000002E-4,6.5822299999999999E-4,6.20193E-4,5.9021500000000005E-4,5.2825099999999998E-4,4.5076300000000002E-4,4.0493700000000002E-4,3.4927999999999999E-4]
[null,null,null,678,3.1271899999999999E-4,3.5911899999999997E-4,4.0550699999999999E-4,4.7361899999999999E-4,5.4093200000000004E-4,5.6289800000000004E-4,5.9028699999999999E-4,5.9008599999999997E-4,6.2867100000000003E-4,6.1353799999999995E-4,6.1587800000000004E-4,6.3113000000000004E-4,5.9688199999999997E-4,5.6531400000000003E-4,5.5691599999999996E-4,4.7792800000000002E-4,4.3051800000000001E-4,3.8902700000000001E-4,3.0741699999999999E-4,2.9538299999999997E-4,3.6628099999999999E-4,4.3311700000000001E-4,4.8630199999999998E-4,5.0216799999999999E-4,5.4958800000000005E-4,5.9000100000000005E-4,6.1947300000000005E-4,6.2600799999999995E-4,6.1334900000000001E-4,6.2192400000000004E-4,6.0399200000000003E-4,5.9236100000000002E-4,5.2671900000000004E-4,4.8053499999999998E-4,4.25535E-4,3.6384999999999998E-4,2.9871200000000002E-4]
[null,null,null,679,2.8140000000000001E-4,3.6126799999999998E-4,4.2702799999999998E-4,4.6464500000000002E-4,5.3006899999999998E-4,5.6482400000000001E-4,5.9680599999999996E-4,6.0670600000000004E-4,6.1772200000000002E-4,6.37821E-4,5.9470599999999997E-4,5.9890200000000001E-4,5.8411900000000002E-4,5.5642500000000004E-4,5.3165600000000003E-4,4.5528499999999999E-4,4.04199E-4,3.6464000000000001E-4,3.03555E-4,3.17361E-4,3.7137999999999998E-4,4.1431900000000002E-4,4.7479999999999999E-4,5.1888300000000004E-4,5.4162600000000002E-4,5.7796599999999996E-4,6.1995099999999999E-4,5.8501600000000005E-4,6.1861999999999996E-4,6.2184199999999995E-4,6.0306599999999998E-4,5.6138800000000001E-4,5.3256199999999999E-4,4.66324E-4,4.1437499999999998E-4,3.5353000000000001E-4,3.08626E-4]
[null,null,null,680,2.9285100000000001E-4,3.7643600000000001E-4,4.3547399999999998E-4,4.8335700000000001E-4,5.2718299999999997E-4,5.5369000000000002E-4,5.6267399999999999E-4,6.4115799999999996E-4,6.0912200000000003E-4,6.0743699999999995E-4,6.0694099999999995E-4,5.9590299999999995E-4,5.7165000000000004E-4,5.4321999999999997E-4,5.0587899999999999E-4,4.8783300000000002E-4,4.2135799999999999E-4,3.4936199999999998E-4,3.23627E-4,2.9889700000000001E-4,3.7167400000000001E-4,4.3042200000000002E-4,4.61056E-4,5.1927500000000003E-4,5.4422300000000004E-4,5.8533700000000001E-4,6.0141999999999997E-4,5.9358600000000001E-4,6.1140599999999999E-4,6.0353900000000005E-4,5.6852499999999995E-4,5.5942399999999999E-4,5.2537199999999997E-4,4.8954599999999999E-4,4.3087000000000003E-4,3.61806E-4,3.1027000000000002E-4]
[null,null,null,681,3.0524300000000002E-4,3.59995E-4,3.9609500000000001E-4,4.4485299999999999E-4,4.9558600000000001E-4,5.3906799999999997E-4,5.5075100000000004E-4,5.83491E-4,5.96478E-4,5.76433E-4,5.8182500000000001E-4,5.7882400000000003E-4,5.8039500000000004E-4,5.3653399999999997E-4,5.0547799999999996E-4,4.3755600000000002E-4,4.0440400000000003E-4,3.4948299999999999E-4,2.9377100000000002E-4,2.76252E-4,3.51319E-4,4.2585700000000003E-4,4.4930399999999998E-4,5.0383700000000003E-4,5.1482100000000005E-4,5.4315099999999996E-4,5.6481499999999998E-4,5.7971400000000005E-4,5.86927E-4,5.9880600000000001E-4,5.7415600000000004E-4,5.2874699999999998E-4,5.06362E-4,4.3807500000000001E-4,3.9295999999999998E-4,3.4687999999999999E-4,2.8588799999999998E-4]
[null,null,null,682,2.8966899999999999E-4,3.35547E-4,3.8534099999999998E-4,4.42867E-4,4.7923300000000002E-4,5.2840700000000005E-4,5.4286299999999998E-4,5.7964799999999999E-4,5.7326000000000002E-4,5.7458100000000001E-4,5.5906599999999999E-4,5.6022099999999996E-4,5.3922799999999999E-4,5.3129900000000005E-4,4.95193E-4,4.3807500000000001E-4,3.89477E-4,3.3461E-4,2.83796E-4,2.8377799999999999E-4,3.4402400000000001E-4,4.0229799999999999E-4,4.5243099999999999E-4,4.7254699999999997E-4,5.0946100000000001E-4,5.3512000000000004E-4,5.5542799999999995E-4,5.7832300000000005E-4,5.7460599999999997E-4,5.8181699999999999E-4,5.4604000000000002E-4,5.1932200000000001E-4,4.9141099999999997E-4,4.4071600000000001E-4,3.7576100000000001E-4,3.3230199999999998E-4,2.83844E-4]
[null,null,null,683,2.95467E-4,3.5107699999999999E-4,4.0226599999999997E-4,4.6130500000000002E-4,4.9144300000000004E-4,5.3140700000000002E-4,5.6245700000000004E-4,5.8034099999999995E-4,5.8620000000000005E-4,5.9269200000000002E-4,5.7299100000000002E-4,5.9506399999999997E-4,5.5733200000000001E-4,5.4502800000000003E-4,5.0386400000000003E-4,4.6526899999999998E-4,4.1095299999999998E-4,3.5460199999999998E-4,2.9898300000000001E-4,3.19337E-4,3.7774199999999998E-4,4.15819E-4,4.7651900000000001E-4,4.8893500000000002E-4,5.3659699999999999E-4,5.5696900000000004E-4,5.5911000000000003E-4,5.9634599999999999E-4,5.9469099999999995E-4,5.7851799999999998E-4,5.5888300000000004E-4,5.2271299999999995E-4,5.0303000000000001E-4,4.6295700000000001E-4,3.9590900000000001E-4,3.5197899999999999E-4,3.2064000000000002E-4]
[null,null,null,684,2.9542700000000002E-4,3.5212600000000002E-4,4.1459E-4,4.5001699999999998E-4,4.7955600000000001E-4,5.2951199999999999E-4,5.1225999999999995E-4,5.6911699999999995E-4,5.5727999999999995E-4,5.8939099999999998E-4,5.7596500000000001E-4,5.7671100000000004E-4,5.5460399999999999E-4,5.2249399999999997E-4,4.8451800000000003E-4,4.7376900000000002E-4,4.1111000000000001E-4,3.5583899999999999E-4,2.79392E-4,3.0383599999999998E-4,3.6835200000000001E-4,3.9898899999999998E-4,4.5468400000000001E-4,4.7288700000000001E-4,5.17283E-4,5.6281899999999999E-4,5.4620999999999999E-4,5.6008800000000004E-4,5.9157600000000002E-4,5.9338000000000001E-4,5.6643700000000004E-4,4.9888999999999999E-4,4.9428199999999997E-4,4.4943700000000001E-4,4.0788700000000001E-4,3.3684999999999997E-4,2.82601E-4]
[null,null,null,685,2.4547600000000001E-4,2.7842900000000001E-4,3.5201600000000003E-4,3.7938799999999998E-4,4.4442499999999997E-4,4.58102E-4,4.8659000000000002E-4,5.0928300000000002E-4,5.13241E-4,5.0097499999999997E-4,5.0330899999999996E-4,5.0438499999999999E-4,4.9083799999999995E-4,4.7731899999999997E-4,4.2412299999999999E-4,3.87356E-4,3.3114800000000002E-4,2.8312699999999999E-4,2.56266E-4,2.46653E-4,3.1326500000000002E-4,3.6162899999999998E-4,3.8314300000000001E-4,4.4197600000000001E-4,4.7627500000000002E-4,4.6502000000000002E-4,4.8153699999999998E-4,5.0424699999999999E-4,5.0499099999999999E-4,5.0030599999999995E-4,5.1182300000000001E-4,4.5932500000000001E-4,4.2985700000000001E-4,3.8391599999999999E-4,3.3793199999999999E-4,2.8328499999999998E-4,2.3922400000000001E-4]
[null,null,null,686,2.8681699999999997E-4,3.1049499999999999E-4,3.8843299999999999E-4,4.2261600000000001E-4,4.6600599999999998E-4,4.8731499999999999E-4,5.0978600000000003E-4,5.2878699999999996E-4,5.3471699999999998E-4,5.2888100000000003E-4,5.3200700000000003E-4,5.05763E-4,4.9955500000000005E-4,4.7081199999999998E-4,4.5210699999999999E-4,4.1404899999999999E-4,3.69012E-4,3.1848899999999998E-4,2.86691E-4,2.6910500000000001E-4,3.2938100000000001E-4,3.7219800000000002E-4,4.0615399999999999E-4,4.6675200000000002E-4,4.8015299999999998E-4,5.1423400000000002E-4,5.2479399999999998E-4,5.22957E-4,5.2922799999999997E-4,5.2323300000000001E-4,5.1283100000000005E-4,4.9271899999999997E-4,4.5581700000000002E-4,4.1136800000000001E-4,3.7626599999999999E-4,2.94479E-4,2.66946E-4]
[null,null,null,687,2.3443100000000001E-4,2.8214800000000002E-4,3.53178E-4,3.8839400000000002E-4,4.3149600000000002E-4,4.49763E-4,4.6730099999999999E-4,4.8208000000000002E-4,5.0316599999999999E-4,5.0148E-4,5.0604199999999995E-4,4.7686899999999999E-4,4.7632399999999997E-4,4.5087600000000001E-4,4.1961400000000001E-4,3.9492800000000001E-4,3.3360300000000002E-4,2.8126600000000001E-4,2.6572999999999999E-4,2.5511199999999999E-4,3.1653600000000002E-4,3.5577999999999999E-4,3.7435000000000002E-4,4.2998899999999998E-4,4.5196800000000002E-4,4.8648700000000002E-4,5.1015399999999997E-4,4.8498200000000001E-4,5.2115899999999999E-4,5.00089E-4,4.82929E-4,4.6382900000000002E-4,4.3420699999999998E-4,3.8526199999999999E-4,3.41276E-4,2.9652299999999998E-4,2.40762E-4]
[null,null,null,688,2.51869E-4,3.11711E-4,3.5226799999999998E-4,3.8434999999999999E-4,4.2669799999999999E-4,4.5030599999999998E-4,4.67212E-4,4.8207499999999999E-4,4.9985899999999996E-4,4.9788800000000004E-4,4.9714699999999998E-4,4.6264E-4,4.5959000000000001E-4,4.50252E-4,4.2003500000000003E-4,3.8949200000000002E-4,3.4309500000000002E-4,2.9180699999999999E-4,2.5747900000000002E-4,2.6982900000000002E-4,3.0316099999999998E-4,3.4619199999999999E-4,3.8813500000000001E-4,4.19238E-4,4.5883600000000001E-4,4.8389400000000001E-4,4.9193900000000005E-4,4.7347200000000001E-4,5.0434299999999998E-4,5.08173E-4,4.78911E-4,4.51681E-4,4.1166199999999998E-4,3.8470000000000003E-4,3.4788400000000002E-4,3.0662799999999998E-4,2.4641600000000001E-4]
[null,null,null,689,2.2446200000000001E-4,2.83066E-4,3.0416699999999999E-4,3.52593E-4,4.02956E-4,4.2715800000000002E-4,4.4400899999999998E-4,4.5557399999999999E-4,4.71237E-4,4.57706E-4,4.67567E-4,4.87601E-4,4.3312500000000002E-4,4.1846299999999999E-4,4.03087E-4,3.6062099999999999E-4,3.2179300000000001E-4,2.8649300000000002E-4,2.24377E-4,2.3341E-4,2.79726E-4,3.3104E-4,3.4458600000000002E-4,4.0506100000000002E-4,4.3084999999999998E-4,4.3113199999999998E-4,4.4798400000000001E-4,4.4966100000000002E-4,4.9190799999999999E-4,4.63301E-4,4.5738099999999998E-4,4.2496999999999999E-4,4.0341599999999997E-4,3.6576399999999998E-4,3.1064500000000002E-4,2.5939499999999999E-4,2.5506200000000002E-4]
[null,null,null,690,2.0861100000000001E-4,2.7015200000000001E-4,3.07638E-4,3.4608700000000002E-4,3.8190400000000002E-4,4.0680300000000001E-4,4.3470100000000001E-4,4.36563E-4,4.35244E-4,4.5889800000000001E-4,4.3144499999999997E-4,4.34776E-4,4.3403400000000003E-4,4.0517800000000002E-4,3.7734200000000002E-4,3.34517E-4,2.9126100000000002E-4,2.67032E-4,2.2104700000000001E-4,2.1958599999999999E-4,2.6732500000000001E-4,2.9265699999999999E-4,3.3533199999999998E-4,3.77444E-4,4.06103E-4,4.0082900000000001E-4,4.3409399999999999E-4,4.6854299999999998E-4,4.4091200000000001E-4,4.2964300000000001E-4,4.3316600000000002E-4,4.2199700000000002E-4,3.7613099999999998E-4,3.3667199999999999E-4,2.8692799999999999E-4,2.5839E-4,2.1837399999999999E-4]
[null,null,null,691,1.8010500000000001E-4,2.30943E-4,2.88072E-4,3.2267599999999998E-4,3.59403E-4,3.86399E-4,3.98732E-4,4.06303E-4,4.1202900000000001E-4,4.0092799999999999E-4,4.2326100000000003E-4,4.0149499999999998E-4,3.85139E-4,3.6891000000000002E-4,3.4894899999999998E-4,3.1390200000000002E-4,2.5953E-4,2.2929800000000001E-4,1.8027599999999999E-4,1.9525200000000001E-4,2.3591700000000001E-4,2.5532300000000001E-4,3.2376699999999998E-4,3.5996599999999998E-4,3.6072699999999998E-4,3.7497099999999998E-4,4.0074899999999999E-4,4.1740100000000002E-4,4.08393E-4,3.9658899999999998E-4,3.9088600000000001E-4,3.82708E-4,3.4753200000000001E-4,2.92038E-4,2.7613399999999998E-4,2.2656900000000001E-4,1.8282899999999999E-4]
[null,null,null,692,1.9451399999999999E-4,2.3221799999999999E-4,2.7485699999999999E-4,3.0741299999999998E-4,3.6048599999999998E-4,3.6403E-4,4.0094799999999998E-4,4.1549099999999998E-4,4.25005E-4,3.9524800000000001E-4,4.1922599999999997E-4,4.0818000000000001E-4,3.8949200000000002E-4,3.6330999999999999E-4,3.3634499999999999E-4,3.0706199999999998E-4,2.7599900000000003E-4,2.2494E-4,2.08712E-4,2.02948E-4,2.3882800000000001E-4,2.72599E-4,3.1035299999999997E-4,3.5939400000000002E-4,3.5732400000000001E-4,3.94645E-4,3.9616800000000002E-4,4.1545800000000001E-4,4.0885699999999999E-4,4.1192000000000003E-4,4.0017200000000002E-4,3.8388499999999999E-4,3.4745199999999999E-4,3.06602E-4,2.6848699999999998E-4,2.4343499999999999E-4,1.9447400000000001E-4]
[null,null,null,693,1.83726E-4,2.1116E-4,2.6104399999999999E-4,2.91298E-4,3.3565299999999999E-4,3.5253299999999998E-4,3.8520399999999999E-4,3.9175400000000002E-4,4.1284200000000002E-4,4.0262799999999998E-4,3.8660499999999999E-4,3.8297400000000001E-4,3.7816199999999998E-4,3.4183100000000001E-4,3.3930499999999998E-4,2.9928700000000002E-4,2.5375700000000002E-4,2.1706899999999999E-4,1.8778800000000001E-4,2.0537800000000001E-4,2.29313E-4,2.5756999999999999E-4,3.07108E-4,3.2027100000000001E-4,3.4727100000000002E-4,3.5887199999999999E-4,3.8686900000000003E-4,3.8612299999999999E-4,3.8673800000000002E-4,3.9502199999999997E-4,3.6381800000000002E-4,3.6026299999999999E-4,3.3877799999999997E-4,2.9636199999999999E-4,2.56431E-4,2.2959099999999999E-4,1.7191099999999999E-4]
[null,null,null,694,2.1961800000000001E-4,2.58156E-4,2.7966999999999998E-4,3.4915E-4,3.6371E-4,4.06475E-4,4.0593999999999998E-4,4.2984700000000002E-4,4.1616999999999999E-4,4.2937900000000002E-4,4.27212E-4,4.0704000000000001E-4,3.7686799999999998E-4,3.8674E-4,3.6131299999999999E-4,3.3323000000000001E-4,2.8870700000000003E-4,2.5576100000000002E-4,2.1370499999999999E-4,2.2326600000000001E-4,2.9455600000000002E-4,2.9705200000000001E-4,3.4302200000000001E-4,3.6271600000000001E-4,4.0702799999999998E-4,4.0868799999999999E-4,4.2117800000000003E-4,4.2345099999999998E-4,4.1732800000000001E-4,4.2197399999999998E-4,3.9542800000000002E-4,3.97823E-4,3.5970799999999998E-4,3.23617E-4,3.05493E-4,2.4030300000000001E-4,2.38218E-4]
[null,null,null,695,2.09779E-4,2.5995599999999999E-4,2.7328399999999999E-4,3.1685099999999999E-4,3.3482500000000002E-4,3.8106499999999998E-4,3.8747599999999999E-4,3.9540400000000002E-4,4.0942799999999998E-4,4.0643500000000002E-4,3.9140799999999999E-4,3.9219E-4,3.6844200000000002E-4,3.6584200000000001E-4,3.4946599999999999E-4,3.0027999999999999E-4,2.7986100000000001E-4,2.4780199999999998E-4,2.13809E-4,2.1341599999999999E-4,2.6541599999999998E-4,2.8732399999999999E-4,3.1429500000000003E-4,3.4561999999999999E-4,3.4864299999999999E-4,3.7449400000000001E-4,3.96232E-4,4.1219E-4,4.2396699999999997E-4,3.8026200000000003E-4,3.92493E-4,3.5768799999999999E-4,3.5302700000000001E-4,2.9954599999999998E-4,2.7074299999999999E-4,2.3859E-4,1.8779800000000001E-4]
[null,null,null,696,2.1403000000000001E-4,2.6268899999999998E-4,2.6757700000000002E-4,3.0238999999999998E-4,3.3702599999999998E-4,3.6756199999999999E-4,3.8946899999999998E-4,3.66203E-4,3.9959199999999999E-4,3.9395899999999999E-4,3.8828400000000002E-4,4.1257499999999999E-4,3.5831799999999999E-4,3.6865299999999998E-4,3.4180799999999998E-4,3.0446599999999998E-4,2.79196E-4,2.4053599999999999E-4,2.1257399999999999E-4,2.24417E-4,2.5206099999999998E-4,2.8961999999999998E-4,3.1223999999999998E-4,3.3921400000000001E-4,3.62791E-4,3.9766399999999999E-4,3.7973199999999998E-4,3.9702299999999998E-4,4.1254900000000001E-4,4.0406300000000002E-4,3.9802899999999999E-4,3.6847200000000001E-4,3.4402199999999998E-4,3.0279800000000001E-4,2.7752300000000001E-4,2.5041000000000001E-4,1.98183E-4]
[null,null,null,697,2.02616E-4,2.3275600000000001E-4,2.7252899999999998E-4,2.9795100000000002E-4,3.3252200000000003E-4,3.56039E-4,3.7954299999999998E-4,3.7843099999999998E-4,4.0841500000000003E-4,3.7028199999999999E-4,3.9058799999999998E-4,3.8374299999999997E-4,3.6064799999999998E-4,3.70007E-4,3.2647200000000001E-4,3.0674599999999999E-4,2.5372900000000001E-4,2.37049E-4,1.9327600000000001E-4,1.9213300000000001E-4,2.47314E-4,2.70437E-4,3.1732599999999999E-4,3.3067099999999999E-4,3.39499E-4,3.6021499999999999E-4,3.7066600000000002E-4,3.9908400000000002E-4,3.94714E-4,3.9681999999999999E-4,3.52183E-4,3.4976199999999999E-4,3.3412200000000001E-4,2.9955999999999998E-4,2.7470899999999999E-4,2.3775099999999999E-4,2.04167E-4]
[null,null,null,698,1.92664E-4,2.2223100000000001E-4,2.4950999999999999E-4,2.67886E-4,3.1301400000000002E-4,3.3345599999999999E-4,3.4187200000000001E-4,3.5626899999999999E-4,3.8359499999999998E-4,3.69818E-4,3.6432199999999999E-4,3.3284599999999998E-4,3.45118E-4,3.31343E-4,3.4118799999999997E-4,2.8726400000000002E-4,2.6333299999999998E-4,2.13401E-4,1.8882999999999999E-4,1.9331E-4,2.0493700000000001E-4,2.5095500000000003E-4,2.8174500000000002E-4,3.0215800000000002E-4,3.4142100000000001E-4,3.6310800000000001E-4,3.3445399999999998E-4,3.7153199999999999E-4,3.6095300000000001E-4,3.62147E-4,3.5381699999999998E-4,3.3497000000000003E-4,3.04223E-4,2.9682299999999999E-4,2.69962E-4,2.26243E-4,1.8113299999999999E-4]
[null,null,null,699,1.7462399999999999E-4,2.0727399999999999E-4,2.38099E-4,2.74145E-4,2.9984100000000002E-4,3.0896899999999998E-4,3.4277400000000001E-4,3.2960800000000001E-4,3.5857E-4,3.5048499999999999E-4,3.7081100000000002E-4,3.2856299999999998E-4,3.38098E-4,3.2058800000000001E-4,2.9729099999999998E-4,2.7615700000000002E-4,2.4215099999999999E-4,2.15801E-4,1.8726499999999999E-4,1.9217099999999999E-4,2.2423000000000001E-4,2.4280999999999999E-4,2.70017E-4,2.9636000000000002E-4,3.2735499999999999E-4,3.4983200000000001E-4,3.5253999999999998E-4,3.5622799999999999E-4,3.5108399999999999E-4,3.4221000000000002E-4,3.3011800000000001E-4,3.1232999999999999E-4,2.9324599999999999E-4,2.7223900000000002E-4,2.25725E-4,1.9849900000000001E-4,1.6273399999999999E-4]
[null,null,null,700,1.88767E-4,2.0656900000000001E-4,2.5497699999999998E-4,2.8505799999999998E-4,3.0020399999999999E-4,3.3118299999999998E-4,3.4275000000000001E-4,3.6315700000000002E-4,3.5430200000000002E-4,3.6077E-4,3.5372600000000001E-4,3.5696000000000002E-4,3.2643199999999998E-4,3.3408400000000001E-4,3.1728799999999999E-4,2.7608999999999999E-4,2.4760400000000001E-4,2.3783499999999999E-4,1.8542799999999999E-4,1.9029999999999999E-4,2.3659899999999999E-4,2.4653899999999999E-4,2.6732600000000002E-4,3.1512400000000001E-4,3.2309400000000001E-4,3.2180799999999998E-4,3.5802499999999999E-4,3.5040800000000002E-4,3.7479899999999999E-4,3.6812500000000002E-4,3.34865E-4,3.2044400000000002E-4,3.1380999999999998E-4,2.83668E-4,2.4696100000000002E-4,2.1128299999999999E-4,1.7481300000000001E-4]
[null,null,null,701,2.0281800000000001E-4,2.1988500000000001E-4,2.6536499999999999E-4,2.9416700000000002E-4,3.1582499999999999E-4,3.3892699999999999E-4,3.58022E-4,3.6621599999999999E-4,3.6607399999999998E-4,3.7930599999999999E-4,3.7248700000000001E-4,3.6840799999999997E-4,3.3716399999999999E-4,3.3520099999999998E-4,3.1724900000000002E-4,2.8448299999999998E-4,2.5353700000000002E-4,2.3389799999999999E-4,1.99865E-4,1.9789100000000001E-4,2.4706100000000003E-4,2.5546500000000002E-4,2.8312699999999999E-4,3.1954800000000001E-4,3.3555299999999999E-4,3.3224399999999999E-4,3.6718699999999999E-4,3.5879E-4,3.7130799999999999E-4,3.5579999999999997E-4,3.4368300000000001E-4,3.2600499999999998E-4,3.1745500000000002E-4,2.8584999999999998E-4,2.6151499999999998E-4,2.2772999999999999E-4,1.8872600000000001E-4]
[null,null,null,702,1.3097099999999999E-4,1.7662099999999999E-4,2.16808E-4,2.4475099999999997E-4,2.7491000000000001E-4,2.8802E-4,3.0148000000000002E-4,2.97278E-4,3.22188E-4,3.06905E-4,3.1674699999999998E-4,3.1304199999999998E-4,3.0307899999999999E-4,2.8883499999999998E-4,2.5902100000000001E-4,2.28008E-4,2.0877100000000001E-4,1.8892900000000001E-4,1.3760199999999999E-4,1.5216000000000001E-4,1.77164E-4,1.9737699999999999E-4,2.3170600000000001E-4,2.8888200000000002E-4,2.6411199999999999E-4,2.9158999999999999E-4,2.9436099999999998E-4,2.9942499999999997E-4,3.1031400000000001E-4,2.9959300000000002E-4,2.97416E-4,2.7966299999999998E-4,2.4887800000000001E-4,2.4048599999999999E-4,1.9727899999999999E-4,1.61018E-4,1.49388E-4]
[null,null,null,703,1.38973E-4,1.5469E-4,1.90077E-4,2.11938E-4,2.50296E-4,2.6554299999999997E-4,2.8341E-4,2.7888499999999998E-4,2.9889499999999998E-4,2.95347E-4,3.0546300000000001E-4,2.9542799999999998E-4,2.7682599999999998E-4,2.4686700000000001E-4,2.4690900000000002E-4,2.03014E-4,1.61702E-4,1.5802399999999999E-4,1.10164E-4,1.4154E-4,1.5447900000000001E-4,1.99905E-4,2.4251200000000001E-4,2.3074400000000001E-4,2.6108499999999998E-4,2.5110699999999998E-4,2.9026099999999999E-4,2.8494700000000002E-4,2.9172300000000003E-4,2.93026E-4,2.9429E-4,2.7322300000000001E-4,2.4799199999999999E-4,2.2382700000000001E-4,2.0045999999999999E-4,1.7742600000000001E-4,1.4758999999999999E-4]
[null,null,null,704,1.17565E-4,1.6144299999999999E-4,1.9004100000000001E-4,2.2867300000000001E-4,2.44515E-4,2.5907000000000003E-4,2.8459900000000002E-4,2.8545399999999998E-4,2.8746199999999999E-4,2.9007300000000001E-4,2.8009500000000001E-4,2.8999100000000002E-4,2.76273E-4,2.4401499999999999E-4,2.5224600000000002E-4,2.1531400000000001E-4,1.8289599999999999E-4,1.7853500000000001E-4,1.4152699999999999E-4,1.3469999999999999E-4,1.5257199999999999E-4,1.9023299999999999E-4,2.1501499999999999E-4,2.53539E-4,2.6609099999999998E-4,2.8082999999999998E-4,2.9192299999999998E-4,2.8348799999999998E-4,3.0416900000000002E-4,2.8212099999999998E-4,2.8294399999999998E-4,2.6427500000000001E-4,2.5060399999999997E-4,2.1964799999999999E-4,1.7567799999999999E-4,1.6152500000000001E-4,1.4192100000000001E-4]
[null,null,null,705,1.42695E-4,1.7420200000000001E-4,2.0547299999999999E-4,2.3768800000000001E-4,2.5133099999999998E-4,2.6471699999999998E-4,2.92241E-4,2.9901400000000001E-4,2.94923E-4,3.1033900000000002E-4,3.0125600000000002E-4,3.0526199999999999E-4,2.8764399999999999E-4,2.6147799999999999E-4,2.5783199999999999E-4,2.2562400000000001E-4,1.9499099999999999E-4,1.7846499999999999E-4,1.32578E-4,1.3936999999999999E-4,1.7255600000000001E-4,1.96465E-4,2.2677999999999999E-4,2.39311E-4,2.5310099999999999E-4,2.7799299999999998E-4,2.8316300000000001E-4,2.8175999999999999E-4,3.0653700000000001E-4,2.7705399999999999E-4,2.89163E-4,2.6935199999999999E-4,2.5410899999999998E-4,2.1776799999999999E-4,1.9424500000000001E-4,1.7386100000000001E-4,1.4051600000000001E-4]
[null,null,null,706,1.34599E-4,1.7174900000000001E-4,2.03933E-4,2.27388E-4,2.3932200000000001E-4,2.5993199999999999E-4,2.7726399999999999E-4,2.7605799999999998E-4,2.7657499999999999E-4,2.84181E-4,2.86361E-4,2.8423499999999998E-4,2.7534800000000002E-4,2.5419700000000001E-4,2.37762E-4,2.1218300000000001E-4,1.8716499999999999E-4,1.7073199999999999E-4,1.3759699999999999E-4,1.5487000000000001E-4,1.53728E-4,1.7826699999999999E-4,2.3934800000000001E-4,2.2697099999999999E-4,2.63045E-4,2.6226599999999999E-4,2.7794199999999999E-4,2.7703599999999998E-4,2.8605900000000002E-4,2.8653199999999999E-4,2.8816600000000002E-4,2.5458700000000002E-4,2.5217099999999998E-4,2.31141E-4,2.04744E-4,1.7710600000000001E-4,1.3211599999999999E-4]
[null,null,null,707,1.04662E-4,1.32454E-4,1.7093800000000001E-4,1.9280499999999999E-4,2.0407199999999999E-4,2.1942700000000001E-4,2.3378099999999999E-4,2.4021200000000001E-4,2.5502899999999999E-4,2.3749E-4,2.5693500000000002E-4,2.5694900000000002E-4,2.4014699999999999E-4,2.4980899999999998E-4,2.0423199999999999E-4,2.0367900000000001E-4,1.8353299999999999E-4,1.3428499999999999E-4,1.1293E-4,1.19255E-4,1.3700499999999999E-4,1.6558499999999999E-4,1.7921500000000001E-4,1.98333E-4,2.2651999999999999E-4,2.5754800000000002E-4,2.3215099999999999E-4,2.42449E-4,2.5245999999999998E-4,2.5603799999999999E-4,2.3014199999999999E-4,2.4291800000000001E-4,2.3474999999999999E-4,1.9093199999999999E-4,1.69729E-4,1.5328999999999999E-4,1.19197E-4]
[null,null,null,708,1.2238400000000001E-4,1.6115199999999999E-4,1.78877E-4,1.90686E-4,2.1772600000000001E-4,2.47638E-4,2.58249E-4,2.4621199999999999E-4,2.4658599999999997E-4,2.4777499999999999E-4,2.5857799999999998E-4,2.4827999999999997E-4,2.3501199999999999E-4,2.19213E-4,2.35174E-4,2.0905500000000001E-4,1.8542E-4,1.48601E-4,1.1081099999999999E-4,1.36379E-4,1.6619000000000001E-4,1.8113299999999999E-4,1.9299700000000001E-4,2.3755200000000001E-4,2.37259E-4,2.3301499999999999E-4,2.3843399999999999E-4,2.4645E-4,2.6872700000000002E-4,2.7472500000000002E-4,2.5576899999999998E-4,2.4488199999999998E-4,2.21995E-4,2.0109199999999999E-4,1.9296100000000001E-4,1.4806899999999999E-4,1.2412799999999999E-4]
[null,null,null,709,1.13004E-4,1.4690300000000001E-4,1.6861E-4,1.7872299999999999E-4,1.9711899999999999E-4,2.14174E-4,2.39664E-4,2.3370199999999999E-4,2.40003E-4,2.3881400000000001E-4,2.32847E-4,2.3126900000000001E-4,2.0520900000000001E-4,2.27999E-4,1.9867100000000001E-4,2.0264099999999999E-4,1.5448E-4,1.5877299999999999E-4,1.1782600000000001E-4,1.19095E-4,1.5023799999999999E-4,1.6111000000000001E-4,1.7441000000000001E-4,1.9824099999999999E-4,2.2712700000000001E-4,2.1285600000000001E-4,2.2658199999999999E-4,2.3430799999999999E-4,2.4236599999999999E-4,2.5302000000000001E-4,2.4176300000000001E-4,2.3204500000000001E-4,2.05632E-4,1.9373700000000001E-4,1.5901000000000001E-4,1.28656E-4,1.3757600000000001E-4]
[null,null,null,710,1.0876500000000001E-4,1.26532E-4,1.5839399999999999E-4,1.83334E-4,1.9865900000000001E-4,2.2025500000000001E-4,2.3553199999999999E-4,2.3893300000000001E-4,2.34725E-4,2.30177E-4,2.2702E-4,2.1764899999999999E-4,2.11158E-4,2.2646100000000001E-4,1.86522E-4,1.8135499999999999E-4,1.5543100000000001E-4,1.27563E-4,1.12983E-4,1.07057E-4,1.4014600000000001E-4,1.5337900000000001E-4,1.71476E-4,1.8245300000000001E-4,2.18051E-4,2.0387700000000001E-4,2.2659399999999999E-4,2.2098800000000001E-4,2.3131099999999999E-4,2.3243E-4,2.21475E-4,2.1370199999999999E-4,1.9889300000000001E-4,1.8105000000000001E-4,1.43972E-4,1.2256100000000001E-4,1.16196E-4]
[null,null,null,711,1.20555E-4,1.7318600000000001E-4,1.7942000000000001E-4,2.14835E-4,2.34532E-4,2.4281800000000001E-4,2.5561600000000001E-4,2.5901599999999999E-4,2.5112700000000002E-4,2.7528699999999998E-4,2.6171799999999998E-4,2.55343E-4,2.5848800000000002E-4,2.6316099999999998E-4,2.36584E-4,2.0153099999999999E-4,1.7185099999999999E-4,1.8604200000000001E-4,1.44275E-4,1.58221E-4,1.65014E-4,2.1190900000000001E-4,2.0856499999999999E-4,2.2997100000000001E-4,2.40552E-4,2.7184600000000001E-4,2.4078200000000001E-4,2.6815299999999998E-4,2.6992500000000002E-4,2.6296799999999998E-4,2.6455000000000001E-4,2.5477600000000002E-4,2.26589E-4,2.07159E-4,1.8470199999999999E-4,1.6831600000000001E-4,1.31746E-4]
[null,null,null,712,1.2717199999999999E-4,1.6297499999999999E-4,1.6894100000000001E-4,1.7798E-4,2.0201600000000001E-4,2.01335E-4,2.3099500000000001E-4,2.37984E-4,2.4105E-4,2.3525999999999999E-4,2.5605199999999999E-4,2.3474499999999999E-4,2.2809800000000001E-4,2.0883800000000001E-4,2.02869E-4,1.7882999999999999E-4,1.5394000000000001E-4,1.69455E-4,1.2564299999999999E-4,1.21043E-4,1.5547299999999999E-4,1.5872E-4,1.98774E-4,2.0832199999999999E-4,2.1190299999999999E-4,2.22136E-4,2.4138999999999999E-4,2.22816E-4,2.41055E-4,2.5025699999999999E-4,2.2622399999999999E-4,2.32019E-4,2.18378E-4,1.8189899999999999E-4,1.54284E-4,1.5394000000000001E-4,1.19163E-4]
[null,null,null,713,7.1667000000000003E-5,9.6629100000000006E-5,1.14703E-4,1.3323100000000001E-4,1.5067100000000001E-4,1.7177800000000001E-4,1.8247900000000001E-4,2.0265999999999999E-4,2.0003100000000001E-4,2.1606699999999999E-4,1.8767100000000001E-4,1.8181E-4,1.70602E-4,1.94382E-4,1.6149799999999999E-4,1.2045E-4,9.7291499999999995E-5,9.4270800000000006E-5,8.05133E-5,7.1154099999999997E-5,9.6905999999999997E-5,1.3228299999999999E-4,1.4097599999999999E-4,1.5435399999999999E-4,1.55651E-4,1.8155299999999999E-4,1.8740200000000001E-4,1.88085E-4,1.76074E-4,1.84737E-4,1.8134600000000001E-4,1.78262E-4,1.5278700000000001E-4,1.4684600000000001E-4,1.1565600000000001E-4,9.8181800000000002E-5,8.6370000000000001E-5]
[null,null,null,714,9.7036700000000006E-5,1.2574600000000001E-4,1.54337E-4,1.7809600000000001E-4,1.8889800000000001E-4,1.9767400000000001E-4,2.0771599999999999E-4,2.22976E-4,2.22847E-4,2.2570899999999999E-4,2.1312800000000001E-4,2.13728E-4,2.0482200000000001E-4,1.99946E-4,1.8978699999999999E-4,1.69469E-4,1.2604599999999999E-4,1.3240100000000001E-4,1.1923E-4,1.09574E-4,1.33719E-4,1.6512800000000001E-4,1.7251199999999999E-4,1.8035699999999999E-4,1.8599400000000001E-4,1.9557299999999999E-4,2.3207499999999999E-4,2.3343600000000001E-4,2.08197E-4,2.2446599999999999E-4,2.0767299999999999E-4,2.1466000000000001E-4,1.8213600000000001E-4,1.62631E-4,1.4742499999999999E-4,1.3775899999999999E-4,1.1516899999999999E-4]
[null,null,null,715,1.17508E-4,1.4093800000000001E-4,1.67806E-4,1.89168E-4,2.0466000000000001E-4,2.20227E-4,2.1698999999999999E-4,2.3392899999999999E-4,2.32143E-4,2.2829600000000001E-4,2.3555200000000001E-4,2.2747699999999999E-4,2.18173E-4,2.1209000000000001E-4,1.8784699999999999E-4,1.90013E-4,1.48302E-4,1.4022899999999999E-4,1.4128900000000001E-4,1.2826E-4,1.563E-4,1.7152199999999999E-4,1.92862E-4,2.21277E-4,2.0286600000000001E-4,2.0921000000000001E-4,2.4815200000000002E-4,2.3438899999999999E-4,2.42933E-4,2.3520999999999999E-4,2.2774199999999999E-4,2.2948700000000001E-4,1.9258799999999999E-4,1.7684100000000001E-4,1.6383399999999999E-4,1.55422E-4,1.16359E-4]
[null,null,null,716,8.6840600000000003E-5,1.1849E-4,1.3511E-4,1.5093300000000001E-4,1.6979500000000001E-4,1.7701699999999999E-4,1.7676000000000001E-4,1.8656400000000001E-4,1.9007599999999999E-4,1.8887600000000001E-4,1.9792E-4,2.06844E-4,1.81051E-4,1.6058199999999999E-4,1.6194199999999999E-4,1.4193100000000001E-4,1.2958800000000001E-4,1.05598E-4,1.12051E-4,9.63111E-5,1.1094099999999999E-4,1.2521E-4,1.5043500000000001E-4,1.76338E-4,1.6643699999999999E-4,1.62631E-4,1.82802E-4,1.9481000000000001E-4,1.9017099999999999E-4,1.9069700000000001E-4,1.9018099999999999E-4,1.73155E-4,1.6117200000000001E-4,1.43955E-4,1.0956200000000001E-4,1.18755E-4,1.00583E-4]
[null,null,null,717,8.01361E-5,9.8176099999999997E-5,1.3314699999999999E-4,1.4288199999999999E-4,1.8059E-4,1.72855E-4,1.9485800000000001E-4,1.8772999999999999E-4,2.0640400000000001E-4,1.6333299999999999E-4,1.8955799999999999E-4,1.8364400000000001E-4,1.87567E-4,1.62304E-4,1.5192499999999999E-4,1.3598399999999999E-4,1.3039599999999999E-4,1.03433E-4,8.8494700000000005E-5,9.8565299999999996E-5,1.07206E-4,1.4331200000000001E-4,1.56739E-4,1.6246699999999999E-4,1.78383E-4,1.73103E-4,1.7213600000000001E-4,1.9101200000000001E-4,1.9414200000000001E-4,1.9661099999999999E-4,1.6798E-4,1.6249100000000001E-4,1.63802E-4,1.2519000000000001E-4,1.32748E-4,1.2804299999999999E-4,8.3265399999999997E-5]
[null,null,null,718,8.8336800000000004E-5,1.12477E-4,1.28305E-4,1.4217E-4,1.6919799999999999E-4,1.80571E-4,1.7908400000000001E-4,1.9474999999999999E-4,2.04496E-4,1.8641799999999999E-4,2.0119699999999999E-4,1.7087E-4,1.84453E-4,1.5350699999999999E-4,1.7110899999999999E-4,1.46599E-4,1.3540399999999999E-4,1.0572E-4,9.2476499999999995E-5,9.6800300000000002E-5,1.22044E-4,1.18604E-4,1.4064599999999999E-4,1.5811699999999999E-4,1.68849E-4,1.88796E-4,1.7591699999999999E-4,1.94513E-4,1.92504E-4,2.0114699999999999E-4,1.8294399999999999E-4,1.6731999999999999E-4,1.74468E-4,1.48961E-4,1.09512E-4,1.1366600000000001E-4,8.5892100000000004E-5]
[null,null,null,719,1.14203E-4,1.2349400000000001E-4,1.3428600000000001E-4,1.6407499999999999E-4,1.7791700000000001E-4,1.8727300000000001E-4,1.97741E-4,1.99371E-4,1.96706E-4,2.02945E-4,2.0458600000000001E-4,1.8285600000000001E-4,1.9116200000000001E-4,1.7907E-4,1.77479E-4,1.6631799999999999E-4,1.3057800000000001E-4,1.12768E-4,1.07749E-4,1.1137900000000001E-4,1.29049E-4,1.2838500000000001E-4,1.6004300000000001E-4,1.5603200000000001E-4,1.6943199999999999E-4,2.0830800000000001E-4,2.10087E-4,1.9314700000000001E-4,1.86598E-4,2.0568499999999999E-4,1.9694499999999999E-4,1.8761E-4,1.7926800000000001E-4,1.7597199999999999E-4,1.31187E-4,1.23681E-4,1.02463E-4]
[null,null,null,720,9.0651100000000004E-5,1.05443E-4,1.1434000000000001E-4,1.3709400000000001E-4,1.7748300000000001E-4,1.68429E-4,1.7903E-4,1.7819600000000001E-4,1.75203E-4,1.8912200000000001E-4,1.75577E-4,1.8115199999999999E-4,1.7312499999999999E-4,1.7329699999999999E-4,1.58892E-4,1.5345199999999999E-4,1.2389500000000001E-4,1.0214500000000001E-4,7.6572500000000006E-5,9.93579E-5,1.0249E-4,1.2965700000000001E-4,1.35511E-4,1.3782099999999999E-4,1.5141899999999999E-4,1.6805300000000001E-4,1.8043399999999999E-4,1.85298E-4,1.8692700000000001E-4,1.8514399999999999E-4,1.71414E-4,1.6863300000000001E-4,1.6529399999999999E-4,1.4426700000000001E-4,1.3331399999999999E-4,1.0700300000000001E-4,9.4507500000000003E-5]
[null,null,null,721,7.9913299999999999E-5,1.03954E-4,9.5147000000000002E-5,1.32306E-4,1.4746299999999999E-4,1.4444100000000001E-4,1.5231199999999999E-4,1.60154E-4,1.7755599999999999E-4,1.75546E-4,1.74425E-4,1.4988299999999999E-4,1.6717500000000001E-4,1.49369E-4,1.19041E-4,1.04758E-4,9.3811099999999994E-5,8.3665500000000001E-5,8.6581299999999997E-5,8.1230700000000001E-5,8.89623E-5,1.00874E-4,1.35193E-4,1.4643699999999999E-4,1.4710299999999999E-4,1.4513800000000001E-4,1.52972E-4,1.7341899999999999E-4,1.47947E-4,1.7049E-4,1.5414000000000001E-4,1.4567000000000001E-4,1.59937E-4,1.32316E-4,9.9279799999999998E-5,1.15065E-4,6.6972300000000003E-5]
[null,null,null,722,1.32194E-4,1.3586800000000001E-4,1.38978E-4,1.42072E-4,1.81521E-4,1.6636E-4,1.9217799999999999E-4,1.8551700000000001E-4,1.9832500000000001E-4,1.9710499999999999E-4,1.8306799999999999E-4,1.8750400000000001E-4,2.0604E-4,1.7916199999999999E-4,1.6301799999999999E-4,1.6892799999999999E-4,1.20188E-4,1.15351E-4,9.6351299999999993E-5,1.1233100000000001E-4,1.20927E-4,1.42924E-4,1.6908599999999999E-4,1.6584099999999999E-4,1.7685300000000001E-4,1.9213300000000001E-4,1.8294900000000001E-4,1.9786200000000001E-4,1.86804E-4,1.87307E-4,1.90213E-4,1.8302800000000001E-4,1.5560699999999999E-4,1.6653499999999999E-4,1.3301799999999999E-4,1.16638E-4,9.3348499999999996E-5]
[null,null,null,723,8.9552100000000006E-5,1.04134E-4,1.2157E-4,1.60703E-4,1.5443E-4,1.4717199999999999E-4,1.7304700000000001E-4,1.83594E-4,1.89789E-4,1.7763699999999999E-4,1.83771E-4,1.76596E-4,1.5620599999999999E-4,1.7029799999999999E-4,1.4445899999999999E-4,1.4945E-4,1.13868E-4,1.04091E-4,1.00998E-4,9.3214200000000006E-5,1.09032E-4,1.04601E-4,1.46472E-4,1.6347900000000001E-4,1.7099500000000001E-4,1.73726E-4,1.7211099999999999E-4,1.7193899999999999E-4,1.7798E-4,1.8329699999999999E-4,1.68665E-4,1.6150100000000001E-4,1.5004999999999999E-4,1.40011E-4,1.19361E-4,1.07234E-4,8.9757200000000002E-5]
[null,null,null,724,9.8930099999999997E-5,1.19079E-4,1.45952E-4,1.5050799999999999E-4,1.51061E-4,1.6975399999999999E-4,1.72282E-4,1.8616800000000001E-4,1.96007E-4,1.8610999999999999E-4,1.9258E-4,1.9017400000000001E-4,1.80719E-4,1.7076799999999999E-4,1.6569800000000001E-4,1.52101E-4,1.3519399999999999E-4,1.2546599999999999E-4,1.26181E-4,1.11672E-4,1.2279000000000001E-4,1.2401299999999999E-4,1.4698900000000001E-4,1.5110300000000001E-4,1.8141899999999999E-4,1.90702E-4,1.8536900000000001E-4,1.9420599999999999E-4,1.9158200000000001E-4,1.94632E-4,1.99342E-4,1.7737499999999999E-4,1.5483200000000001E-4,1.4536799999999999E-4,1.34497E-4,1.06562E-4,8.7293700000000001E-5]
[null,null,null,725,5.45666E-5,5.3061700000000001E-5,9.4778199999999993E-5,1.0257899999999999E-4,1.17073E-4,1.1798699999999999E-4,1.26888E-4,1.5026500000000001E-4,1.3171600000000001E-4,1.34096E-4,1.50125E-4,1.2571500000000001E-4,1.3970899999999999E-4,1.20399E-4,1.18739E-4,1.1439500000000001E-4,9.0315099999999999E-5,7.3472200000000004E-5,5.4817200000000001E-5,5.9920300000000003E-5,6.0096100000000002E-5,9.1106800000000007E-5,1.1778E-4,1.2283699999999999E-4,1.2068100000000001E-4,1.3645199999999999E-4,1.51562E-4,1.4739700000000001E-4,1.40168E-4,1.45508E-4,1.5153899999999999E-4,1.2940099999999999E-4,1.13263E-4,1.0801100000000001E-4,9.5430100000000006E-5,7.5067600000000006E-5,4.9892000000000003E-5]
[null,null,null,726,9.0272799999999994E-5,1.04502E-4,1.2506E-4,1.13896E-4,1.38768E-4,1.63692E-4,1.7213800000000001E-4,1.71323E-4,1.55453E-4,1.7137599999999999E-4,1.6534300000000001E-4,1.7046499999999999E-4,1.6077600000000001E-4,1.7744399999999999E-4,1.36489E-4,1.2105200000000001E-4,9.36562E-5,8.6873599999999994E-5,6.8689200000000006E-5,8.6931700000000007E-5,1.01785E-4,1.16601E-4,1.2515000000000001E-4,1.3151699999999999E-4,1.6822300000000001E-4,1.5816699999999999E-4,1.4906500000000001E-4,1.5876099999999999E-4,1.8993699999999999E-4,1.5142500000000001E-4,1.6413300000000001E-4,1.4005300000000001E-4,1.6098999999999999E-4,1.4201099999999999E-4,1.12862E-4,7.5509899999999993E-5,8.3899699999999999E-5]
[null,null,null,727,9.8155500000000006E-5,1.02859E-4,1.07617E-4,1.35601E-4,1.45802E-4,1.6014600000000001E-4,1.4543999999999999E-4,1.5556399999999999E-4,1.81609E-4,1.6090599999999999E-4,1.7142599999999999E-4,1.5718399999999999E-4,1.76007E-4,1.4822699999999999E-4,1.21845E-4,1.2910299999999999E-4,1.2454E-4,9.3694499999999995E-5,9.1429199999999995E-5,7.9034600000000004E-5,1.12803E-4,1.1072E-4,1.4693400000000001E-4,1.3636099999999999E-4,1.4886599999999999E-4,1.54625E-4,1.7202799999999999E-4,1.6720099999999999E-4,1.7964500000000001E-4,1.6738899999999999E-4,1.5899299999999999E-4,1.5112599999999999E-4,1.4144599999999999E-4,1.08441E-4,1.2396E-4,9.4630700000000002E-5,1.18164E-4]
[null,null,null,728,9.8473099999999997E-5,8.47161E-5,9.1404100000000001E-5,1.04435E-4,1.2105899999999999E-4,1.3107200000000001E-4,1.3397600000000001E-4,1.3898200000000001E-4,1.4961299999999999E-4,1.26945E-4,1.4822500000000001E-4,1.45296E-4,1.2727499999999999E-4,1.42743E-4,1.08028E-4,1.17994E-4,8.9964300000000002E-5,8.4104799999999995E-5,6.5153299999999998E-5,6.6260000000000006E-5,9.4908199999999994E-5,8.8845999999999996E-5,1.21313E-4,1.2951099999999999E-4,1.1976099999999999E-4,1.4171999999999999E-4,1.3681899999999999E-4,1.4574299999999999E-4,1.4406400000000001E-4,1.4497499999999999E-4,1.3681899999999999E-4,1.27463E-4,1.3869699999999999E-4,1.13522E-4,9.8741100000000002E-5,9.1288300000000005E-5,8.8641700000000002E-5]
[null,null,null,729,4.8557899999999998E-5,7.1539999999999996E-5,5.8282799999999997E-5,9.2566399999999995E-5,8.24475E-5,1.11858E-4,1.15979E-4,1.13187E-4,1.2734399999999999E-4,1.2996700000000001E-4,1.10982E-4,1.0623799999999999E-4,1.0867299999999999E-4,1.01735E-4,8.05565E-5,6.9917699999999996E-5,7.1820800000000002E-5,7.1405199999999999E-5,4.6691199999999998E-5,4.3306899999999997E-5,6.55712E-5,8.1617299999999995E-5,8.4176699999999997E-5,9.2722399999999998E-5,1.04338E-4,1.10151E-4,1.2410000000000001E-4,1.21907E-4,1.07219E-4,1.21431E-4,1.0042199999999999E-4,1.04518E-4,9.8250899999999998E-5,7.89679E-5,6.7382600000000001E-5,5.1631300000000001E-5,5.1590800000000001E-5]
[null,null,null,730,3.6662000000000002E-5,2.73712E-5,5.7264099999999999E-5,7.2213900000000003E-5,9.4565699999999995E-5,9.8380099999999997E-5,1.00695E-4,1.2241500000000001E-4,1.2612699999999999E-4,1.10919E-4,1.04664E-4,1.15535E-4,1.08398E-4,9.0816999999999995E-5,8.2614400000000006E-5,8.3695000000000004E-5,8.1313500000000007E-5,5.68377E-5,4.24244E-5,3.15463E-5,4.8223499999999997E-5,6.9567999999999995E-5,9.0162900000000004E-5,8.8310699999999995E-5,1.0184200000000001E-4,1.03724E-4,1.09258E-4,1.00497E-4,1.1921000000000001E-4,1.1175699999999999E-4,1.2431899999999999E-4,9.7674600000000002E-5,1.1446999999999999E-4,5.5103099999999998E-5,8.3518500000000003E-5,6.0321800000000002E-5,5.8550500000000001E-5]
[null,null,null,731,7.7732900000000002E-5,8.9180999999999999E-5,9.08688E-5,1.08937E-4,1.11154E-4,1.2868800000000001E-4,1.36792E-4,1.39534E-4,1.34819E-4,1.3955200000000001E-4,1.6135300000000001E-4,1.3620400000000001E-4,1.3467899999999999E-4,1.2255299999999999E-4,1.3655699999999999E-4,1.1362900000000001E-4,8.54482E-5,1.01968E-4,6.7710400000000001E-5,6.4199499999999994E-5,9.4438999999999995E-5,9.6240600000000001E-5,1.04806E-4,1.0755300000000001E-4,1.3864699999999999E-4,1.30562E-4,1.4117700000000001E-4,1.4489200000000001E-4,1.36227E-4,1.6514899999999999E-4,1.2267499999999999E-4,1.4636200000000001E-4,1.27253E-4,1.18516E-4,8.8113499999999996E-5,9.2475300000000005E-5,5.81266E-5]
[null,null,null,732,5.63436E-5,7.1251499999999994E-5,7.8931700000000002E-5,9.9861300000000006E-5,1.10441E-4,1.11691E-4,1.2854699999999999E-4,1.3934700000000001E-4,1.2711100000000001E-4,1.2406900000000001E-4,1.33719E-4,1.2619199999999999E-4,1.2277300000000001E-4,1.2361300000000001E-4,1.09874E-4,1.0119999999999999E-4,7.6712999999999995E-5,8.1265000000000002E-5,5.4113899999999997E-5,6.2993899999999993E-5,7.7312799999999996E-5,1.16588E-4,9.7775499999999999E-5,1.0541599999999999E-4,1.23146E-4,1.2375299999999999E-4,1.18761E-4,1.2271E-4,1.3653100000000001E-4,1.25792E-4,1.2712499999999999E-4,1.07296E-4,8.6982499999999996E-5,9.1560100000000005E-5,8.7338799999999998E-5,7.1648299999999996E-5,5.16647E-5]
[null,null,null,733,6.3038000000000002E-5,7.1197899999999998E-5,9.1930199999999996E-5,9.6800900000000004E-5,1.12803E-4,1.11832E-4,1.2894499999999999E-4,1.3558099999999999E-4,1.35728E-4,1.2386499999999999E-4,1.19065E-4,1.24919E-4,1.37933E-4,1.15276E-4,9.6526000000000004E-5,9.4646200000000002E-5,7.6142899999999999E-5,8.4460200000000002E-5,5.7835399999999999E-5,5.2853199999999997E-5,8.4366100000000005E-5,1.01413E-4,8.8917099999999996E-5,9.2363700000000005E-5,1.13266E-4,1.13595E-4,1.25921E-4,1.0862300000000001E-4,1.2132E-4,1.23607E-4,1.20161E-4,1.17193E-4,8.6675700000000001E-5,1.01834E-4,8.8714099999999998E-5,8.5759400000000004E-5,5.6084200000000001E-5]
[null,null,null,734,9.3722500000000003E-5,1.0839499999999999E-4,1.01982E-4,1.2301099999999999E-4,1.3619200000000001E-4,1.2480999999999999E-4,1.5489400000000001E-4,1.46487E-4,1.6586199999999999E-4,1.58973E-4,1.5460499999999999E-4,1.2863600000000001E-4,1.52511E-4,1.41254E-4,1.4276100000000001E-4,1.2005E-4,8.2611199999999999E-5,1.10857E-4,9.5911199999999997E-5,1.03836E-4,1.1216400000000001E-4,1.0592200000000001E-4,1.1298099999999999E-4,1.3096200000000001E-4,1.32516E-4,1.5918900000000001E-4,1.35193E-4,1.3395099999999999E-4,1.59059E-4,1.6152000000000001E-4,1.6060599999999999E-4,1.36964E-4,1.44201E-4,1.2854899999999999E-4,1.1278299999999999E-4,1.0867200000000001E-4,8.9713100000000007E-5]
[null,null,null,735,4.4666300000000003E-5,4.1987599999999998E-5,8.06088E-5,7.1362100000000006E-5,7.5148999999999995E-5,1.01545E-4,1.10709E-4,1.1205999999999999E-4,1.09443E-4,9.6787999999999996E-5,1.06956E-4,1.04172E-4,1.0244899999999999E-4,1.0118100000000001E-4,9.9107899999999993E-5,6.5449099999999996E-5,6.1070300000000004E-5,6.5491400000000001E-5,4.8076299999999999E-5,3.0836900000000003E-5,6.7049299999999995E-5,5.4906700000000001E-5,8.9017299999999999E-5,9.0424099999999994E-5,1.19042E-4,9.0891700000000003E-5,8.8768299999999995E-5,9.6263399999999997E-5,1.00541E-4,1.32566E-4,9.0044399999999995E-5,9.1813900000000005E-5,8.4176499999999996E-5,7.1884099999999998E-5,4.2483800000000001E-5,5.8674100000000001E-5,3.8336200000000001E-5]
[null,null,null,736,4.21832E-5,5.6425999999999998E-5,7.5553299999999994E-5,8.7490899999999999E-5,7.8072999999999996E-5,9.8531700000000004E-5,9.6749800000000007E-5,1.15213E-4,1.09592E-4,1.0381400000000001E-4,9.2688600000000006E-5,1.2209100000000001E-4,1.15683E-4,9.4749399999999998E-5,1.13268E-4,9.0644300000000002E-5,7.2509500000000001E-5,5.80278E-5,5.5479100000000002E-5,4.2864700000000003E-5,7.2278400000000002E-5,8.0049200000000006E-5,7.91194E-5,1.02422E-4,8.0890399999999994E-5,1.05955E-4,1.03628E-4,9.7569899999999996E-5,9.8965699999999993E-5,1.21816E-4,1.03531E-4,9.9751299999999995E-5,9.7811099999999996E-5,9.4635000000000004E-5,6.9818200000000002E-5,5.4416200000000003E-5,5.3177899999999998E-5]
[null,null,null,737,2.9423800000000001E-5,5.6910400000000003E-5,4.87813E-5,7.7150099999999998E-5,8.4204199999999996E-5,7.0134899999999998E-5,9.9139400000000002E-5,9.8942899999999998E-5,9.8738499999999997E-5,1.07365E-4,9.4527700000000006E-5,1.01172E-4,8.6879500000000001E-5,8.3256499999999998E-5,6.6274999999999998E-5,6.4648100000000002E-5,4.9991000000000003E-5,4.9667299999999998E-5,2.8211199999999999E-5,3.5036100000000002E-5,3.9973099999999998E-5,6.1947999999999997E-5,6.1023300000000002E-5,8.1766099999999996E-5,8.5160699999999999E-5,9.4701200000000001E-5,9.4846700000000001E-5,1.03658E-4,7.5078800000000004E-5,9.1105600000000004E-5,6.9458100000000005E-5,7.1609500000000006E-5,7.1595799999999996E-5,6.2800399999999996E-5,5.2748199999999998E-5,4.3632299999999999E-5,3.3146899999999999E-5]
[null,null,null,738,5.6808400000000003E-5,9.7445600000000001E-5,7.5512499999999999E-5,9.5324799999999999E-5,1.16357E-4,1.10567E-4,1.3910699999999999E-4,1.14003E-4,1.1301100000000001E-4,1.2692199999999999E-4,1.3724700000000001E-4,1.03791E-4,1.11131E-4,1.25513E-4,9.3235799999999999E-5,9.3335899999999995E-5,8.6057999999999995E-5,9.0002599999999998E-5,7.8430399999999994E-5,8.2013299999999996E-5,7.6720500000000005E-5,8.3538199999999999E-5,8.4127899999999998E-5,1.1844E-4,1.1172599999999999E-4,1.1773399999999999E-4,1.3653499999999999E-4,1.3059200000000001E-4,1.0458699999999999E-4,1.2519899999999999E-4,9.4226600000000003E-5,1.01216E-4,1.0741199999999999E-4,1.04941E-4,8.8477299999999994E-5,8.9404400000000001E-5,7.8373099999999997E-5]
[null,null,null,739,6.7694900000000001E-5,8.9285399999999997E-5,7.9591499999999999E-5,8.4132E-5,1.03847E-4,1.13501E-4,1.1198E-4,1.2397100000000001E-4,1.03577E-4,1.23521E-4,1.1287599999999999E-4,1.15738E-4,1.27558E-4,1.1482899999999999E-4,9.3552499999999996E-5,1.1483400000000001E-4,8.1112200000000006E-5,7.5243300000000005E-5,5.3315600000000002E-5,6.6548899999999996E-5,7.1014100000000002E-5,1.0512400000000001E-4,9.40365E-5,1.04281E-4,1.10086E-4,1.15029E-4,1.01557E-4,1.17458E-4,1.2318E-4,1.1202899999999999E-4,1.04008E-4,8.6431699999999994E-5,9.7869500000000002E-5,9.0899899999999993E-5,8.97225E-5,8.0623699999999999E-5,7.0769100000000007E-5]
[null,null,null,740,2.65647E-5,5.4650300000000001E-5,3.9071800000000001E-5,3.72481E-5,4.5539199999999999E-5,6.9125800000000001E-5,6.9011900000000002E-5,7.8657800000000004E-5,7.6708199999999999E-5,8.7223200000000002E-5,8.2222E-5,7.5723000000000007E-5,7.6654699999999996E-5,6.9809100000000002E-5,6.3990299999999996E-5,5.2689899999999998E-5,4.2131400000000001E-5,3.9050200000000001E-5,2.5661799999999999E-5,2.54846E-5,3.3358899999999997E-5,4.4270800000000003E-5,5.43255E-5,5.3096999999999997E-5,7.2418900000000006E-5,7.7599299999999994E-5,8.7978800000000005E-5,7.8238900000000001E-5,6.8863500000000002E-5,8.3050899999999995E-5,7.1695999999999999E-5,7.3226700000000001E-5,4.9743400000000002E-5,2.9339199999999999E-5,3.3933200000000002E-5,3.3083600000000003E-5,2.9961200000000001E-6]
[null,null,null,741,4.5899000000000002E-5,7.3104700000000005E-5,5.8622200000000003E-5,5.8887100000000001E-5,7.6416500000000003E-5,1.03125E-4,9.9062399999999995E-5,9.9551500000000004E-5,8.3957500000000004E-5,1.01377E-4,1.0184299999999999E-4,8.0319800000000003E-5,9.5549699999999998E-5,8.9518599999999994E-5,8.3506300000000004E-5,6.9649700000000005E-5,7.2338300000000005E-5,5.2453900000000003E-5,5.72488E-5,5.1561899999999998E-5,5.1153299999999997E-5,6.6200900000000005E-5,7.6192400000000006E-5,8.9374499999999996E-5,1.02525E-4,8.8903699999999994E-5,9.2606299999999995E-5,8.0828399999999993E-5,1.11561E-4,8.2227599999999999E-5,8.1488200000000004E-5,8.4121200000000004E-5,7.87298E-5,8.97347E-5,6.0936000000000001E-5,6.2691699999999995E-5,4.1263600000000002E-5]
[null,null,null,742,6.1280599999999997E-5,7.4107800000000002E-5,8.0587399999999994E-5,8.7661100000000007E-5,9.7138099999999998E-5,9.6785000000000003E-5,1.05478E-4,1.05425E-4,9.2496299999999997E-5,1.10062E-4,8.7568300000000007E-5,9.37246E-5,8.0736599999999995E-5,1.05721E-4,9.4077699999999995E-5,7.9281699999999997E-5,7.1042600000000003E-5,6.3911400000000006E-5,7.1560300000000007E-5,6.1377000000000005E-5,5.7958100000000003E-5,7.0578499999999995E-5,8.5025500000000001E-5,8.5750799999999999E-5,1.01924E-4,9.9918200000000002E-5,9.9066899999999998E-5,9.08719E-5,1.09511E-4,8.8449599999999994E-5,8.3788600000000006E-5,1.00659E-4,9.84774E-5,8.2182500000000001E-5,6.1546599999999998E-5,6.7600499999999998E-5,6.87513E-5]
[null,null,null,743,5.8181399999999998E-5,4.79903E-5,6.70699E-5,8.4355899999999996E-5,8.9653000000000004E-5,9.1702500000000005E-5,7.5674799999999996E-5,8.9453300000000006E-5,9.7259399999999999E-5,8.3992099999999998E-5,8.9689299999999995E-5,7.9202299999999999E-5,8.5506699999999999E-5,7.9174199999999998E-5,9.1878200000000004E-5,5.2416600000000002E-5,7.2918599999999997E-5,7.50958E-5,4.86174E-5,3.7855300000000003E-5,5.90166E-5,4.85496E-5,6.9954299999999995E-5,8.6381399999999999E-5,1.10523E-4,7.4843800000000003E-5,8.9433399999999997E-5,1.00535E-4,1.18317E-4,1.00132E-4,9.1526800000000006E-5,8.8054900000000003E-5,6.2795100000000005E-5,6.9866500000000006E-5,5.2648400000000002E-5,5.9503599999999997E-5,6.8851700000000004E-5]
[null,null,null,744,7.4641200000000006E-5,7.4899200000000003E-5,6.5378100000000003E-5,8.4355200000000002E-5,1.00678E-4,1.09975E-4,1.00734E-4,1.12409E-4,1.12747E-4,1.25172E-4,1.1359899999999999E-4,1.11641E-4,1.05655E-4,1.1949499999999999E-4,1.0660199999999999E-4,1.00552E-4,5.4664899999999999E-5,7.3301300000000002E-5,6.3857399999999996E-5,7.06117E-5,8.14527E-5,8.5891300000000002E-5,8.6215499999999995E-5,9.1076300000000001E-5,1.18775E-4,1.0454399999999999E-4,1.0097700000000001E-4,8.4371599999999997E-5,1.09874E-4,1.1301799999999999E-4,9.5057199999999995E-5,1.1680699999999999E-4,1.05641E-4,6.9382100000000001E-5,7.3959600000000003E-5,8.4971599999999998E-5,7.1704499999999998E-5]
[null,null,null,745,5.0970100000000002E-5,5.9700900000000003E-5,5.9098000000000002E-5,8.4196299999999999E-5,8.5453900000000005E-5,8.90859E-5,9.3750499999999996E-5,9.7928000000000002E-5,8.5950499999999996E-5,1.13758E-4,1.0126100000000001E-4,9.4139200000000002E-5,7.5496399999999998E-5,9.0854599999999996E-5,8.0718500000000003E-5,7.1352600000000005E-5,8.36376E-5,6.7354799999999994E-5,4.9829600000000001E-5,6.3381500000000003E-5,7.1287199999999997E-5,7.1324700000000005E-5,8.4395599999999995E-5,8.1418300000000006E-5,8.3466200000000004E-5,1.01591E-4,1.02674E-4,1.11044E-4,1.1459E-4,9.7368300000000001E-5,9.7965600000000003E-5,8.5445200000000007E-5,8.9863299999999997E-5,6.45392E-5,8.8182099999999997E-5,6.1222800000000006E-5,6.6530200000000002E-5]
[null,null,null,746,6.9314799999999996E-5,6.0299500000000001E-5,7.9650500000000006E-5,1.03273E-4,8.2199800000000005E-5,9.7332799999999998E-5,9.6204200000000003E-5,1.12187E-4,9.4353500000000004E-5,1.0848E-4,1.12129E-4,9.9692100000000001E-5,9.56962E-5,9.2214100000000002E-5,8.9487000000000006E-5,9.8434099999999993E-5,9.1175999999999996E-5,7.6530800000000003E-5,5.9717199999999998E-5,6.8543700000000006E-5,6.6855500000000004E-5,7.8800299999999998E-5,9.7872600000000002E-5,7.7170999999999997E-5,1.02771E-4,9.3257200000000006E-5,1.2074399999999999E-4,1.00883E-4,1.12496E-4,9.6373399999999994E-5,1.12577E-4,8.8336699999999997E-5,9.2384200000000002E-5,6.6216000000000004E-5,9.0155799999999995E-5,7.5402900000000003E-5,6.2305900000000003E-5]
[null,null,null,747,3.65989E-6,9.3808699999999999E-6,1.00544E-5,4.6549099999999998E-5,3.9062900000000002E-5,3.84068E-5,3.93895E-5,5.3216400000000001E-5,3.5051600000000002E-5,4.1038899999999998E-5,6.2800599999999996E-5,4.4274199999999997E-5,4.2936999999999999E-5,5.61952E-5,4.3299E-5,5.7948000000000002E-5,4.0549200000000001E-5,2.6693500000000001E-5,-3.8726300000000004E-6,1.7143099999999999E-5,3.7191199999999997E-5,4.4700899999999998E-5,5.23659E-5,4.8564099999999998E-5,4.3143299999999997E-5,6.2323000000000006E-5,5.3005199999999999E-5,5.8703099999999997E-5,5.18655E-5,5.2467699999999999E-5,5.3609000000000001E-5,3.1003200000000002E-5,5.6546399999999998E-5,3.1823199999999997E-5,4.0036300000000002E-5,3.3948900000000003E-5,2.53671E-5]
[null,null,null,748,2.0485100000000001E-5,3.7744799999999998E-5,4.1241900000000002E-5,4.3660900000000001E-5,5.1795999999999997E-5,5.6920699999999999E-5,5.92297E-5,2.96673E-5,6.5029299999999998E-5,6.4668199999999999E-5,5.6874099999999998E-5,5.1082899999999998E-5,6.3040700000000001E-5,4.5197200000000002E-5,4.6074700000000001E-5,1.6407499999999998E-5,3.5771E-5,2.9939099999999999E-5,1.1486E-5,1.00545E-5,4.5314300000000001E-5,1.5163E-5,3.84101E-5,4.0025299999999998E-5,3.6921000000000001E-5,3.3645800000000002E-5,3.0094999999999999E-5,5.6170700000000001E-5,4.3496499999999999E-5,5.89702E-5,5.47767E-5,5.6438599999999999E-5,4.36577E-5,1.3424800000000001E-5,3.7462700000000003E-5,3.7472399999999997E-5,1.0167799999999999E-5]
[null,null,null,749,4.4908699999999999E-5,5.08428E-5,5.0123500000000002E-5,7.0202299999999997E-5,5.68379E-5,7.09641E-5,7.2696100000000004E-5,8.0688300000000005E-5,8.1069999999999995E-5,7.2995499999999996E-5,8.6417700000000004E-5,6.90601E-5,7.1188599999999998E-5,6.6338200000000001E-5,7.2622999999999999E-5,5.8359000000000001E-5,3.27823E-5,3.2841800000000001E-5,4.0719900000000003E-5,5.2447600000000002E-5,6.6312100000000005E-5,3.8455499999999998E-5,6.2380900000000004E-5,6.6270200000000001E-5,7.8190900000000004E-5,7.7285299999999997E-5,8.9482999999999997E-5,8.4234199999999994E-5,8.0444400000000005E-5,6.8662400000000002E-5,7.0080399999999994E-5,6.9626499999999995E-5,7.3438500000000005E-5,5.9181999999999997E-5,5.5585199999999998E-5,5.2132999999999997E-5,4.34442E-5]
[null,null,null,750,4.6988599999999999E-5,6.0886900000000001E-5,6.4373000000000002E-5,7.1372900000000002E-5,5.6251900000000003E-5,5.95174E-5,8.1606699999999999E-5,7.9999299999999998E-5,8.5987800000000004E-5,7.9254700000000005E-5,8.7491199999999993E-5,9.6424100000000004E-5,6.6676700000000005E-5,7.7247400000000002E-5,5.6005599999999998E-5,6.0718599999999998E-5,2.58788E-5,6.1500299999999998E-5,4.6932599999999999E-5,3.7181200000000002E-5,4.89668E-5,6.4973600000000004E-5,6.4667999999999998E-5,5.8365700000000003E-5,7.3887099999999999E-5,7.6894800000000001E-5,9.8077299999999997E-5,8.1475600000000003E-5,6.9353899999999993E-5,6.1496999999999998E-5,9.2642899999999994E-5,7.6696300000000006E-5,6.1614700000000005E-5,4.4131300000000002E-5,6.2080499999999996E-5,4.6758500000000003E-5,3.99985E-5]
[null,null,null,751,4.3480899999999999E-5,4.1613100000000003E-5,5.92142E-5,6.7330799999999996E-5,4.5257199999999998E-5,7.6492500000000007E-5,7.54633E-5,6.7797699999999996E-5,9.3858399999999996E-5,9.1732399999999996E-5,5.76968E-5,9.1918599999999998E-5,7.9850600000000004E-5,7.9713200000000001E-5,6.7953299999999999E-5,6.6823300000000001E-5,5.1432599999999999E-5,5.1095199999999998E-5,1.75778E-5,5.3600700000000003E-5,5.3902E-5,6.5236999999999999E-5,6.7019299999999997E-5,7.0286700000000006E-5,5.5706299999999999E-5,7.8775899999999999E-5,7.7960700000000001E-5,8.2607499999999998E-5,7.6081000000000006E-5,7.50464E-5,7.3937199999999994E-5,8.5241599999999994E-5,6.0890000000000001E-5,6.5472499999999994E-5,5.6531599999999999E-5,5.1864799999999999E-5,4.6566000000000001E-5]
[null,null,null,752,2.0914799999999998E-5,3.8755399999999998E-5,4.6412500000000003E-5,7.02378E-5,3.0035800000000001E-5,6.7142699999999997E-5,5.9135799999999997E-5,6.9645899999999997E-5,7.1174000000000007E-5,5.9159700000000002E-5,5.6609700000000001E-5,6.9840700000000004E-5,5.79568E-5,5.1356700000000002E-5,4.6485400000000001E-5,4.4654399999999997E-5,4.7115099999999999E-5,1.6784999999999999E-5,1.6711E-5,1.9675100000000001E-5,3.6124899999999997E-5,3.1562800000000002E-5,6.1438400000000005E-5,4.9539000000000001E-5,3.9245500000000002E-5,7.3057800000000004E-5,6.5068999999999997E-5,4.5772700000000003E-5,4.8267399999999998E-5,6.5075300000000004E-5,4.2037799999999999E-5,6.0788500000000003E-5,5.6459000000000003E-5,4.2948999999999998E-5,4.5299000000000001E-5,4.0275999999999999E-5,2.6742099999999999E-5]
[null,null,null,753,1.18308E-5,2.1970399999999999E-5,7.5524199999999996E-6,2.77049E-5,2.14734E-5,3.1388099999999999E-5,4.0914000000000002E-5,4.13304E-5,5.0779799999999998E-5,4.6553E-5,6.13403E-5,3.7586899999999998E-5,5.0690899999999999E-5,3.8816899999999998E-5,2.9286100000000001E-5,5.91311E-6,-1.07257E-5,1.2628399999999999E-5,2.66141E-5,2.03315E-5,1.30052E-5,2.1973000000000001E-5,4.1660599999999999E-5,4.5111000000000002E-5,2.8061000000000001E-5,3.5982000000000002E-5,3.5184800000000002E-5,3.5201899999999999E-5,5.31604E-5,5.7592800000000002E-5,4.5817900000000001E-5,4.0825599999999998E-5,6.0396100000000003E-5,1.64022E-5,2.01013E-5,4.9992499999999996E-6,-9.1840399999999999E-6]
[null,null,null,754,5.73943E-5,5.16243E-5,6.6416900000000004E-5,8.1944200000000001E-5,7.7029500000000005E-5,6.9202000000000006E-5,8.07572E-5,1.02435E-4,9.1963E-5,1.0568700000000001E-4,8.3961699999999999E-5,1.01603E-4,7.3072199999999995E-5,7.7282500000000004E-5,7.8802500000000003E-5,6.78888E-5,8.0994499999999998E-5,5.66185E-5,5.5511099999999998E-5,4.4487200000000003E-5,5.4972200000000002E-5,6.59422E-5,7.6531000000000003E-5,6.3447699999999999E-5,8.2403899999999999E-5,8.8069600000000001E-5,9.8848100000000007E-5,1.09969E-4,9.6372200000000005E-5,1.0119999999999999E-4,8.5885300000000003E-5,6.9985800000000003E-5,7.5065899999999996E-5,7.4195800000000005E-5,6.9708499999999998E-5,7.3467700000000001E-5,5.3421200000000003E-5]
[null,null,null,755,6.6799900000000004E-5,4.1690999999999998E-5,4.30426E-5,5.0741100000000001E-5,7.1932899999999997E-5,4.6346800000000002E-5,5.6891300000000002E-5,5.8623099999999998E-5,7.9624900000000004E-5,5.4732299999999998E-5,6.7511900000000007E-5,7.6898100000000002E-5,6.1773900000000002E-5,5.5217299999999997E-5,5.8611199999999999E-5,3.7319700000000001E-5,5.55463E-5,4.6665999999999997E-5,2.4543299999999999E-5,3.89202E-5,3.7151899999999999E-5,3.3231600000000002E-5,4.3024900000000002E-5,4.2481600000000003E-5,3.9569300000000001E-5,6.8993199999999995E-5,7.6511499999999994E-5,5.3650100000000003E-5,7.2326199999999999E-5,6.8567799999999998E-5,5.8231099999999999E-5,5.1640300000000001E-5,6.0700299999999999E-5,4.8120600000000001E-5,3.2664699999999999E-5,4.2284999999999999E-5,3.0026400000000001E-5]
[null,null,null,756,4.7802100000000001E-5,6.3164500000000001E-5,6.1846400000000005E-5,5.3128899999999999E-5,8.8062500000000006E-5,7.00553E-5,6.4022499999999999E-5,9.00776E-5,8.4613199999999998E-5,6.24343E-5,8.8036799999999997E-5,8.44288E-5,7.0973299999999994E-5,7.6806900000000005E-5,5.9335E-5,5.8028000000000001E-5,6.67886E-5,4.5657600000000001E-5,4.4929000000000003E-5,4.2171600000000001E-5,5.2238699999999998E-5,5.0402100000000003E-5,5.0015900000000003E-5,6.0071300000000002E-5,7.1857E-5,8.2975500000000005E-5,7.4402500000000005E-5,5.80184E-5,7.6252099999999995E-5,8.1709400000000001E-5,5.3498000000000002E-5,8.2783100000000004E-5,6.8074499999999993E-5,5.35249E-5,6.3136299999999994E-5,6.0425299999999999E-5,5.2370500000000003E-5]
[null,null,null,757,6.0623800000000001E-5,7.5280500000000005E-5,7.7840899999999995E-5,7.6360500000000002E-5,7.6525800000000005E-5,8.2915800000000003E-5,8.8444999999999998E-5,9.5783299999999995E-5,8.7101999999999994E-5,8.8737899999999996E-5,1.0383299999999999E-4,9.3300699999999999E-5,8.0427199999999995E-5,1.03062E-4,8.2413699999999993E-5,9.46795E-5,6.5156599999999999E-5,7.8410800000000005E-5,7.9496699999999994E-5,5.4275699999999999E-5,5.9420199999999997E-5,7.9923099999999994E-5,8.0765899999999999E-5,1.07027E-4,6.7394100000000006E-5,8.7492500000000003E-5,8.2126700000000001E-5,8.8562599999999998E-5,8.1893599999999998E-5,8.1624600000000005E-5,8.5171400000000002E-5,7.1301400000000001E-5,8.2405700000000003E-5,6.6844300000000006E-5,6.8535900000000002E-5,6.7119200000000006E-5,6.3744000000000005E-5]
[null,null,null,758,3.22937E-6,3.5771200000000001E-5,3.7393099999999999E-5,3.4899099999999999E-5,5.0497000000000001E-5,3.3439799999999998E-5,4.7778300000000003E-5,4.10988E-5,5.8108500000000001E-5,5.6906800000000002E-5,5.4460599999999998E-5,4.9534699999999999E-5,5.25391E-5,4.1307899999999998E-5,4.8414900000000003E-5,5.0713900000000002E-5,3.5583100000000002E-5,2.43333E-5,4.0028199999999997E-5,2.88159E-5,2.5474400000000001E-5,5.8696200000000002E-5,2.49221E-5,3.1041999999999999E-5,5.4123499999999998E-5,4.2062099999999998E-5,5.7281399999999997E-5,3.8003899999999997E-5,4.69609E-5,5.0961599999999997E-5,4.7853299999999998E-5,5.3488E-5,3.4049299999999999E-5,2.8487500000000001E-5,9.4366700000000002E-6,1.92902E-5,3.35055E-5]
[null,null,null,759,2.6298000000000001E-5,4.5902400000000003E-5,4.8561199999999998E-5,4.88059E-5,5.7315999999999998E-5,5.2186599999999999E-5,5.6455900000000003E-5,5.9660999999999997E-5,5.1591700000000003E-5,6.1693399999999994E-5,4.3860599999999998E-5,5.6113699999999998E-5,7.0322500000000003E-5,5.4052899999999999E-5,5.9266399999999999E-5,6.0261399999999999E-5,6.2791499999999997E-5,4.9966799999999997E-5,2.96348E-5,2.83308E-5,4.0360800000000002E-5,4.7432599999999997E-5,5.0386100000000002E-5,5.89797E-5,6.5585400000000004E-5,5.4312399999999999E-5,4.7753500000000003E-5,6.0792799999999998E-5,3.9620799999999999E-5,6.8651099999999997E-5,3.5647600000000001E-5,4.4938899999999998E-5,2.7420099999999999E-5,3.27916E-5,3.20437E-5,2.04195E-5,1.76908E-5]
[null,null,null,760,5.0234600000000002E-5,6.7775300000000001E-5,8.0197600000000006E-5,7.9533699999999994E-5,7.8895799999999998E-5,7.3094899999999997E-5,8.7345300000000005E-5,8.01268E-5,8.53868E-5,9.4097400000000005E-5,8.2514200000000004E-5,1.02286E-4,8.6849100000000002E-5,7.9421799999999999E-5,7.8601099999999995E-5,7.1431099999999994E-5,6.1325299999999994E-5,7.5758400000000003E-5,4.9895000000000003E-5,5.1752799999999997E-5,7.2762900000000001E-5,6.7126100000000001E-5,7.37887E-5,6.9957599999999996E-5,7.3665700000000002E-5,7.9955200000000003E-5,8.3029100000000001E-5,9.5287399999999998E-5,9.4474200000000004E-5,9.6126900000000003E-5,8.3913199999999995E-5,6.5036999999999994E-5,8.1141400000000002E-5,5.6169699999999999E-5,7.2658399999999995E-5,4.9812999999999999E-5,4.0639799999999997E-5]
[null,null,null,761,2.14531E-5,3.3531200000000002E-5,4.3917700000000001E-5,5.1551999999999997E-5,2.9730099999999998E-5,4.2772799999999998E-5,5.4828599999999999E-5,4.0989699999999998E-5,5.7482200000000003E-5,5.3992700000000002E-5,4.4281199999999999E-5,7.6976800000000005E-5,5.6109600000000002E-5,8.1188599999999997E-5,6.50274E-5,6.2002999999999996E-5,4.9947100000000002E-5,1.7441599999999999E-5,3.4985399999999999E-5,5.1032799999999997E-5,4.5606899999999999E-5,5.8179700000000001E-5,4.58764E-5,4.4251700000000002E-5,3.4953100000000003E-5,5.1789300000000002E-5,3.4396600000000002E-5,5.4150999999999997E-5,6.1322700000000002E-5,7.0975000000000004E-5,6.3899700000000001E-5,5.6050400000000001E-5,6.4733099999999999E-5,5.4796699999999997E-5,1.7466399999999999E-5,4.2993E-5,2.2927099999999999E-5]
[null,null,null,762,1.98556E-5,1.33486E-5,2.7571400000000002E-5,2.5843800000000001E-5,1.81403E-5,2.40663E-5,2.9570400000000001E-5,4.95941E-5,4.1501800000000003E-5,3.78013E-5,3.8009600000000003E-5,4.0635500000000001E-5,2.0366499999999999E-5,2.1295199999999999E-5,1.9975399999999999E-5,3.1137599999999998E-5,1.7807300000000001E-5,2.12588E-5,8.2087100000000006E-6,8.8267899999999992E-6,-3.6028999999999998E-8,1.5760399999999999E-5,1.1060700000000001E-7,2.4058199999999999E-5,2.5403500000000002E-5,4.6099900000000002E-5,2.6221299999999999E-5,4.88121E-5,4.0723999999999998E-5,3.5598E-5,2.1699500000000001E-5,4.0729899999999999E-6,2.5204000000000001E-5,3.8690100000000004E-6,1.6461999999999999E-5,1.2157999999999999E-5,1.7194099999999999E-5]
[null,null,null,763,4.1244700000000002E-5,3.2794099999999998E-5,3.9897200000000001E-5,3.7379300000000003E-5,4.4138199999999997E-5,6.1110899999999998E-5,5.2969800000000002E-5,5.2903299999999999E-5,5.6293299999999999E-5,5.0690699999999999E-5,5.47737E-5,5.5949200000000003E-5,5.34201E-5,5.1941899999999998E-5,4.7126699999999997E-5,3.9754800000000001E-5,4.0059999999999999E-5,2.8745400000000001E-5,4.2073400000000003E-5,2.86629E-5,3.9239100000000002E-5,3.6966499999999999E-5,6.0658300000000002E-5,5.21991E-5,6.07964E-5,6.5147800000000007E-5,6.8076400000000004E-5,6.1062700000000001E-5,6.2145700000000004E-5,8.0774900000000005E-5,5.9350800000000001E-5,5.40009E-5,7.15325E-5,4.1285899999999997E-5,2.8538999999999999E-5,4.6830699999999999E-5,1.57393E-5]
[null,null,null,764,2.13928E-5,2.16541E-5,2.21951E-5,3.2968E-5,4.2134300000000001E-5,3.27638E-5,3.6001699999999998E-5,4.8807000000000002E-5,4.4239800000000003E-5,3.9335200000000002E-5,4.7540000000000002E-5,4.5807899999999999E-5,3.2433600000000001E-5,3.2820900000000003E-5,3.1633500000000001E-5,4.1395700000000001E-5,3.2644300000000002E-5,2.3779200000000001E-5,1.32784E-5,2.0523899999999998E-5,2.3677400000000001E-5,2.4159899999999999E-5,3.6392900000000002E-5,2.2070500000000002E-5,4.5489399999999999E-5,4.4910899999999997E-5,4.6279999999999997E-5,3.2781099999999997E-5,3.04182E-5,4.6921800000000002E-5,3.3979100000000001E-5,3.3615699999999997E-5,4.9885300000000002E-5,2.02479E-5,2.4516899999999999E-5,2.25984E-5,1.80495E-6]
[null,null,null,765,2.2322100000000001E-5,2.5516100000000001E-5,3.3936400000000003E-5,4.4671400000000001E-5,4.8689000000000001E-5,5.50333E-5,5.2021899999999997E-5,5.9945399999999997E-5,5.8529000000000002E-5,5.78175E-5,5.8595899999999999E-5,6.0016499999999997E-5,4.2434700000000002E-5,5.0627300000000002E-5,4.54466E-5,5.63865E-5,4.6382099999999998E-5,3.0242800000000001E-5,2.0585400000000001E-5,3.7312699999999999E-5,3.5658999999999999E-5,2.1274999999999999E-5,2.66607E-5,4.7309799999999999E-5,4.5547299999999997E-5,6.62138E-5,3.8219200000000002E-5,5.0262100000000001E-5,3.9598100000000003E-5,5.3094499999999998E-5,4.5200700000000002E-5,2.6303199999999999E-5,7.1443699999999995E-5,2.6594600000000001E-5,4.3254999999999998E-5,2.3690199999999999E-5,2.5750099999999999E-5]
[null,null,null,766,-3.3320500000000001E-5,-8.7827699999999996E-6,-2.22119E-5,-1.07089E-5,-3.4485800000000001E-5,-1.88679E-6,-2.5996800000000002E-5,6.4343499999999996E-6,-3.2187100000000002E-5,-2.0112400000000001E-5,1.4581700000000001E-6,-1.6396300000000001E-5,1.8599800000000001E-5,8.1567999999999996E-6,-1.0552400000000001E-5,-2.84222E-5,-9.4778799999999998E-6,-4.32092E-5,-2.9152199999999998E-5,-3.1819000000000001E-5,-5.8155800000000001E-6,-2.7135E-5,-1.9831999999999999E-5,-2.6270799999999999E-5,-2.3677500000000002E-5,1.44614E-5,-2.45405E-5,-9.1885199999999995E-7,2.4225800000000002E-6,-2.8124599999999998E-5,5.3319900000000001E-6,-6.0593200000000003E-7,-8.0074799999999994E-6,-1.1911499999999999E-5,-4.0176000000000003E-5,-1.1087899999999999E-5,-1.9746E-5]
[null,null,null,767,2.8006900000000001E-5,2.32072E-5,2.7506799999999999E-5,5.8609800000000003E-5,2.11193E-5,2.6919599999999999E-5,3.64292E-5,3.8229100000000003E-5,3.4340300000000001E-5,2.5365199999999999E-5,3.5112299999999999E-5,2.98205E-5,3.5738499999999997E-5,3.40837E-5,2.63794E-5,3.3507200000000003E-5,2.4536799999999999E-5,1.6271699999999999E-5,5.04718E-6,8.5707099999999998E-6,1.12027E-5,3.34348E-5,1.50162E-5,2.7516800000000001E-5,2.88036E-5,4.4224200000000003E-5,3.7446100000000001E-5,3.38118E-5,4.0737700000000001E-5,4.0385100000000001E-5,1.9680000000000001E-5,4.9540599999999998E-5,3.6510500000000002E-5,2.1483699999999999E-5,1.45531E-5,3.5052599999999997E-5,2.9331100000000001E-5]
[null,null,null,768,3.38734E-5,2.8806399999999999E-5,2.3029800000000001E-5,4.1296900000000001E-5,4.3225900000000002E-5,4.9117299999999998E-5,5.1770800000000002E-5,3.6132800000000001E-5,4.3106399999999998E-5,5.4491499999999998E-5,5.2554099999999999E-5,5.6564300000000003E-5,4.1937400000000003E-5,5.4882700000000002E-5,3.3206800000000002E-5,5.9354000000000001E-5,2.3906499999999999E-5,2.4721600000000001E-5,3.9724700000000003E-5,1.9775E-5,3.3719300000000001E-5,4.6155700000000003E-5,5.09352E-5,5.3220799999999997E-5,3.7342899999999998E-5,4.9057600000000003E-5,5.1713799999999999E-5,5.6361599999999999E-5,6.0164500000000003E-5,4.7060500000000001E-5,5.96472E-5,4.9206899999999998E-5,5.2714699999999999E-5,4.5914900000000003E-5,3.1913599999999999E-5,4.2718E-5,5.5458699999999998E-5]
[null,null,null,769,3.6267499999999998E-5,3.31533E-5,3.4970800000000001E-5,4.66706E-5,3.00523E-5,4.6525099999999999E-5,4.4545000000000001E-5,4.51871E-5,4.0571200000000002E-5,5.3063299999999997E-5,5.3473100000000001E-5,4.7096699999999999E-5,4.7605999999999998E-5,4.4476099999999999E-5,5.1002999999999999E-5,5.0244799999999997E-5,3.2405099999999999E-5,3.5288099999999998E-5,3.6897300000000003E-5,1.92761E-5,3.3722900000000002E-5,2.2988599999999999E-5,4.9553599999999999E-5,5.5790500000000001E-5,4.1589099999999998E-5,6.1287500000000006E-5,5.1459899999999998E-5,3.9511799999999997E-5,5.6630299999999999E-5,5.0780399999999999E-5,6.2064599999999995E-5,4.5933999999999998E-5,5.23536E-5,4.7666200000000001E-5,3.2522199999999998E-5,5.3450099999999998E-5,2.8487200000000001E-5]
[null,null,null,770,2.9022599999999999E-6,1.6352399999999999E-5,2.83156E-5,1.4653399999999999E-5,9.9567400000000002E-6,3.2230999999999997E-5,8.9129900000000002E-6,2.03778E-5,3.8264499999999999E-5,2.0164099999999999E-5,2.4346600000000002E-5,1.5438300000000001E-5,2.0743399999999999E-5,1.6984900000000001E-5,5.3630400000000004E-6,1.6984900000000001E-5,1.34919E-5,4.2775699999999999E-6,9.7932100000000004E-6,1.6949600000000001E-5,3.4620500000000002E-6,-6.5481E-6,2.4937199999999999E-5,3.5491100000000003E-5,1.02316E-5,2.2624900000000001E-5,4.5859100000000003E-5,1.31796E-5,5.50734E-5,3.6573699999999998E-5,3.5347099999999999E-5,2.90323E-5,3.3308500000000001E-5,5.0857099999999998E-5,2.2754700000000001E-5,1.5865100000000002E-5,-1.3689900000000001E-5]
[null,null,null,771,4.5073200000000001E-5,4.1760900000000002E-5,5.7680399999999998E-5,6.7004300000000005E-5,6.2402099999999997E-5,5.57252E-5,5.5575200000000003E-5,7.5097099999999996E-5,8.9668399999999997E-5,7.7578100000000002E-5,7.51299E-5,6.2567100000000006E-5,8.2859899999999996E-5,7.89309E-5,7.93697E-5,7.4376799999999996E-5,5.33303E-5,5.8628000000000002E-5,3.6354599999999999E-5,6.4064499999999996E-5,6.5541099999999995E-5,3.91299E-5,7.4705399999999998E-5,6.65263E-5,4.8893400000000002E-5,7.8258500000000003E-5,8.2030199999999999E-5,6.34264E-5,8.3009699999999999E-5,7.5448800000000002E-5,8.8639299999999997E-5,6.7462199999999999E-5,6.6119700000000003E-5,5.4363300000000002E-5,5.3142E-5,3.8897999999999999E-5,4.7544499999999999E-5]
[null,null,null,772,1.3223399999999999E-5,1.8277299999999999E-5,1.5230599999999999E-5,9.6169600000000002E-6,3.4751700000000001E-5,1.4391300000000001E-5,2.64857E-5,1.67839E-5,3.6901299999999999E-5,2.7438200000000001E-5,2.5554E-5,2.8682599999999999E-5,2.1602499999999999E-5,1.6876199999999999E-5,2.2668899999999999E-5,1.9201399999999999E-5,1.7623200000000001E-5,2.2743200000000001E-6,5.4026600000000003E-8,2.0111399999999999E-5,2.99007E-5,3.6407099999999999E-5,1.75392E-5,2.3609799999999999E-5,1.1501199999999999E-5,4.3702200000000003E-5,3.1154300000000001E-5,2.4516699999999999E-5,5.5257499999999997E-5,4.27212E-5,4.5235399999999997E-5,2.3099699999999998E-5,1.83397E-5,2.67285E-5,2.9291599999999999E-5,4.8366200000000001E-6,3.3027000000000001E-5]
[null,null,null,773,5.4497999999999999E-5,4.3682900000000002E-5,5.1209199999999998E-5,4.7108099999999997E-5,5.9027300000000003E-5,6.3294300000000001E-5,6.2660899999999995E-5,4.7725000000000001E-5,6.0433400000000003E-5,5.2927000000000003E-5,4.3063199999999998E-5,4.8765599999999999E-5,4.32309E-5,3.6680200000000002E-5,3.2978300000000002E-5,3.8398000000000001E-5,4.00417E-5,3.87715E-5,4.18683E-5,4.56445E-5,4.2488599999999998E-5,4.6816700000000002E-5,3.1230499999999999E-5,3.5110800000000003E-5,4.6128299999999997E-5,5.4997100000000002E-5,6.5522E-5,5.2009100000000003E-5,5.75334E-5,5.9949499999999999E-5,5.4464900000000001E-5,5.8338899999999998E-5,5.7747700000000003E-5,2.5933500000000002E-5,5.3947599999999998E-5,3.8198499999999997E-5,5.1215199999999997E-5]
[null,null,null,774,2.3365599999999999E-5,4.9941500000000003E-5,4.1239999999999998E-5,2.6305900000000002E-5,4.2988300000000003E-5,3.9499899999999998E-5,4.9345399999999997E-5,3.2847800000000001E-5,5.6679699999999999E-5,4.7700100000000001E-5,4.1196299999999997E-5,2.97526E-5,3.1038999999999999E-5,5.1944499999999997E-5,2.1827500000000001E-5,3.45195E-5,3.8457600000000003E-5,2.69525E-5,2.9436499999999998E-5,1.16559E-5,1.8068899999999999E-5,2.68768E-5,1.6096700000000001E-5,3.6010799999999997E-5,4.6253800000000001E-5,5.6963000000000003E-5,4.7022399999999999E-5,5.0421099999999997E-5,4.4771999999999998E-5,4.8340700000000003E-5,2.0386799999999999E-5,4.9755000000000001E-5,2.87729E-5,3.0179600000000002E-5,4.1813100000000001E-5,1.65196E-5,1.03804E-5]
[null,null,null,775,4.8711100000000002E-5,3.4402E-5,5.7361200000000002E-5,7.1813899999999994E-5,5.82349E-5,6.6377000000000005E-5,6.9751800000000005E-5,7.9903399999999998E-5,6.5952599999999996E-5,5.78577E-5,6.67086E-5,6.0401800000000002E-5,5.4080899999999999E-5,5.8931500000000003E-5,6.0461799999999998E-5,7.2463400000000001E-5,4.0938800000000002E-5,3.5677599999999999E-5,4.8440699999999999E-5,2.0958099999999998E-5,4.3811399999999999E-5,3.3438500000000002E-5,3.5159900000000002E-5,6.5719100000000006E-5,5.2907E-5,4.1228099999999999E-5,7.3884600000000001E-5,3.6555199999999999E-5,6.6836599999999996E-5,6.4854100000000006E-5,5.9935100000000002E-5,5.12414E-5,7.3540800000000006E-5,5.3148900000000002E-5,5.3975399999999998E-5,6.5266199999999995E-5,3.8831200000000002E-5]
[null,null,null,776,-1.7143499999999999E-5,1.4199900000000001E-6,9.8573800000000001E-6,2.8924999999999998E-6,1.95821E-5,1.8217900000000001E-5,7.7996200000000004E-6,1.18631E-5,1.39574E-5,9.2590000000000006E-6,1.9907499999999999E-5,3.0362299999999999E-5,2.1986800000000001E-5,2.3646500000000001E-5,1.05303E-5,5.74374E-6,6.4996800000000001E-6,-4.6126200000000002E-6,-6.5672100000000003E-6,1.08609E-6,-9.0207699999999997E-6,-3.6597100000000002E-6,1.30336E-5,5.3479299999999996E-6,1.006E-5,2.4973600000000001E-5,2.3496400000000001E-5,2.2410300000000001E-5,2.99811E-5,2.04318E-5,4.5896899999999998E-5,1.41197E-5,1.3105800000000001E-5,9.1187900000000008E-6,2.43039E-5,1.43354E-5,1.2680500000000001E-6]
[null,null,null,777,1.8541599999999999E-6,5.5447799999999997E-7,6.6506999999999997E-6,1.46846E-5,1.08047E-5,2.2155100000000001E-5,1.3679099999999999E-5,1.19147E-5,2.1971E-5,2.19802E-5,2.5198499999999999E-5,1.41198E-5,5.9101899999999999E-6,1.7815100000000002E-5,1.9204699999999999E-5,4.9044199999999997E-6,5.72611E-6,3.3299099999999999E-6,2.03632E-6,-5.5475499999999999E-7,5.1721799999999997E-6,-1.6606700000000001E-6,1.376E-5,1.0435600000000001E-5,1.7824899999999999E-5,1.1831899999999999E-5,1.0608000000000001E-5,1.41192E-5,1.79007E-5,1.70002E-5,2.02233E-5,1.39444E-5,2.21548E-5,7.4905100000000004E-6,2.5038000000000001E-6,1.0806599999999999E-5,6.0092300000000004E-6]
[null,null,null,778,2.18535E-5,8.2270799999999998E-6,3.6341099999999997E-5,1.4935300000000001E-5,2.8343600000000001E-5,2.7588599999999999E-5,3.1631499999999997E-5,3.07768E-5,3.4013800000000003E-5,6.1925600000000002E-5,1.88773E-5,3.3407500000000002E-5,1.9420300000000001E-5,1.8881100000000001E-5,2.48495E-5,2.4800899999999998E-5,-4.7307100000000001E-6,9.0692699999999993E-6,1.8201100000000001E-5,1.2368700000000001E-5,2.80991E-5,2.3049099999999999E-5,2.35331E-5,9.9177699999999997E-6,2.21578E-5,3.0298799999999999E-5,1.75423E-5,3.5662900000000002E-6,3.9183800000000003E-5,2.4554900000000001E-5,2.5712999999999999E-5,1.64066E-5,3.2562499999999999E-5,3.9251000000000001E-5,1.72426E-5,2.1698699999999999E-5,9.4485499999999995E-6]
[null,null,null,779,2.86598E-6,1.4238300000000001E-5,2.8316699999999999E-5,4.0431900000000002E-5,3.5961899999999999E-5,3.6014799999999999E-5,2.3995500000000001E-5,1.6010699999999999E-5,1.14854E-5,4.7289300000000001E-5,3.16731E-5,2.0547099999999998E-5,3.0655999999999999E-5,4.5332900000000001E-5,3.1631999999999998E-5,2.64305E-5,2.1171299999999998E-5,1.9342800000000001E-5,3.6315400000000001E-5,-9.8494299999999996E-6,2.33429E-5,3.3624699999999997E-5,1.6611000000000001E-5,2.14331E-5,3.0162E-5,2.9014799999999999E-5,1.6064200000000001E-5,4.8364600000000001E-5,2.8243300000000001E-5,3.5586200000000002E-5,2.5851300000000001E-5,3.3601700000000001E-5,3.2489900000000002E-5,3.47295E-5,1.34762E-5,3.5865599999999998E-5,1.6490999999999998E-5]
[null,null,null,780,6.3855600000000006E-5,5.3694099999999998E-5,5.5327900000000003E-5,7.7665100000000003E-5,7.4011399999999994E-5,6.6023899999999996E-5,6.0694399999999999E-5,5.85591E-5,7.6198000000000005E-5,7.2945400000000001E-5,6.0539299999999998E-5,7.17675E-5,5.5674300000000003E-5,8.0437699999999997E-5,5.8908700000000001E-5,6.2045700000000001E-5,4.3395700000000002E-5,7.7525000000000001E-5,4.1576299999999997E-5,4.5913099999999999E-5,6.2953799999999993E-5,7.9256499999999996E-5,5.5498000000000003E-5,7.2034100000000002E-5,7.8360400000000003E-5,5.50425E-5,4.9384600000000001E-5,3.81691E-5,7.3370500000000005E-5,5.4192199999999999E-5,5.9758900000000001E-5,4.5181400000000001E-5,5.5169900000000002E-5,6.1799799999999997E-5,4.4744099999999997E-5,3.49985E-5,4.7595900000000003E-5]
[null,null,null,781,1.4158899999999999E-5,3.4607899999999998E-5,1.4548900000000001E-5,3.6465899999999999E-5,2.0375000000000001E-5,2.0183800000000001E-5,3.0894600000000001E-5,2.3366600000000001E-5,3.3810899999999998E-5,3.8781400000000001E-5,3.4749500000000003E-5,4.4201900000000001E-5,3.4679399999999999E-5,2.692E-5,3.1799499999999999E-5,2.3223599999999999E-5,1.9550699999999999E-5,2.313E-5,9.9229100000000002E-6,1.2489399999999999E-5,1.7447000000000001E-5,3.53477E-5,2.0508899999999999E-5,9.0492400000000008E-6,3.8062399999999997E-5,2.0545300000000001E-5,2.0780599999999999E-5,1.7427499999999999E-5,2.8523100000000001E-5,3.2616000000000001E-5,3.6092600000000001E-5,2.70916E-5,1.7517199999999999E-5,2.0788499999999999E-5,1.3934000000000001E-5,2.0833900000000001E-5,2.7736500000000001E-5]
[null,null,null,782,1.6935999999999998E-5,2.31547E-5,1.7081699999999999E-5,9.5591600000000005E-6,1.56172E-5,3.3406499999999999E-5,1.17411E-5,4.53541E-5,3.0647700000000001E-5,2.08647E-5,4.43221E-5,1.25462E-5,8.7756900000000007E-6,3.1275400000000002E-5,1.82316E-5,1.5019500000000001E-5,2.00083E-5,3.3695100000000002E-5,-1.51993E-5,1.2281499999999999E-5,8.5228499999999998E-7,3.5090499999999999E-6,1.3086599999999999E-5,8.5582399999999999E-6,1.8101499999999999E-5,9.2364500000000003E-6,1.40983E-5,6.0428500000000001E-6,1.4886699999999999E-5,2.68583E-5,3.3367700000000002E-5,2.8590199999999999E-5,1.56605E-5,9.7312700000000008E-6,6.8818000000000001E-8,4.4783E-6,2.6392699999999999E-5]
[null,null,null,783,1.8804599999999999E-5,1.0605099999999999E-5,1.6900399999999998E-5,1.4297299999999999E-5,3.8461399999999997E-6,1.28491E-5,2.3337E-5,2.7231599999999999E-5,2.04164E-5,7.2246399999999997E-6,2.3226699999999999E-5,7.4913499999999999E-6,1.3824000000000001E-6,3.1918400000000003E-5,1.9995300000000001E-5,1.8865999999999999E-5,1.70868E-5,-5.3450700000000003E-6,-1.9380599999999999E-5,1.5073E-6,-1.03628E-6,3.7826999999999998E-6,1.0396499999999999E-5,2.0554300000000001E-5,-2.4419699999999999E-5,1.8756199999999998E-5,1.16245E-5,2.82117E-5,-5.66167E-6,4.1610599999999998E-5,2.4383999999999999E-5,1.1015100000000001E-5,1.17997E-5,1.9633700000000001E-5,1.7897000000000002E-5,-1.1789E-5,-3.2768199999999998E-6]
[null,null,null,784,-2.2098200000000001E-6,3.02594E-5,-1.01888E-5,1.30424E-6,-1.23103E-5,1.0290799999999999E-6,1.9222399999999998E-6,2.1058200000000001E-5,1.6849500000000001E-6,-6.4332499999999998E-6,1.54414E-6,-1.0451500000000001E-6,8.7053699999999993E-6,-1.1746199999999999E-5,1.30234E-5,-1.00166E-5,-6.2468500000000002E-6,-7.9960700000000008E-6,7.1785899999999997E-7,-6.5953600000000002E-6,1.05889E-5,3.9269700000000003E-6,1.7562799999999999E-6,-4.0597600000000002E-6,-1.00462E-5,-1.03297E-5,-2.6813200000000002E-6,-4.6775599999999996E-6,1.3737399999999999E-6,2.5325299999999999E-6,5.8547E-6,1.5585000000000001E-5,-1.8947499999999999E-6,-2.92812E-5,-8.1089400000000007E-6,-1.2663199999999999E-5,-1.22195E-5]
[null,null,null,785,4.6500299999999999E-5,5.2658799999999998E-5,5.59662E-5,4.7978200000000001E-5,7.0679599999999993E-5,5.0942300000000002E-5,4.8704600000000001E-5,6.05465E-5,7.14368E-5,4.5065399999999997E-5,5.8759199999999998E-5,5.0621699999999997E-5,7.6595199999999995E-5,3.6007999999999998E-5,5.4242200000000001E-5,4.9517600000000002E-5,5.63094E-5,4.85617E-5,4.4861100000000003E-5,6.7164300000000003E-5,4.6356400000000002E-5,4.9870000000000002E-5,6.9066999999999994E-5,6.9902900000000005E-5,6.3474300000000003E-5,6.1212199999999996E-5,5.0059799999999998E-5,7.7547700000000003E-5,5.6991299999999998E-5,6.0356499999999997E-5,6.72338E-5,6.3280600000000005E-5,6.2622599999999999E-5,4.6001000000000002E-5,5.1360200000000003E-5,5.3549199999999999E-5,4.9337299999999999E-5]
[null,null,null,786,2.39659E-5,3.3198000000000003E-5,2.7095999999999999E-5,3.2367699999999998E-5,4.2860800000000001E-5,2.75938E-5,4.4342599999999998E-5,4.3929099999999999E-5,3.8853799999999997E-5,3.4270799999999997E-5,4.38398E-5,5.0542299999999999E-5,4.56445E-5,3.2733E-5,2.7949500000000001E-5,4.7805800000000002E-5,3.6736600000000003E-5,2.4351000000000001E-5,1.9916100000000001E-5,2.5622400000000001E-5,2.81333E-5,3.5653199999999999E-5,3.6130000000000001E-5,4.0574200000000002E-5,2.9041099999999999E-5,6.8199600000000003E-5,4.2331399999999999E-5,4.3638399999999999E-5,5.0958000000000002E-5,4.5905899999999997E-5,4.0429400000000003E-5,2.8938500000000001E-5,4.4960799999999998E-5,3.3826799999999999E-5,3.4792500000000003E-5,3.8926500000000001E-5,3.4445E-5]
[null,null,null,787,1.6455300000000002E-5,2.6707999999999999E-5,2.8419400000000001E-5,3.1657099999999999E-5,2.9249000000000001E-5,3.0335400000000001E-5,2.9032600000000001E-5,5.1131000000000002E-5,4.2624599999999998E-5,3.9755000000000001E-5,6.9777000000000006E-5,3.1480199999999997E-5,3.7233800000000003E-5,2.9749099999999999E-5,4.9026300000000002E-5,3.8430699999999998E-5,4.3477499999999998E-5,4.6680200000000001E-5,1.90708E-5,2.1753600000000001E-5,4.0301800000000001E-5,3.7583899999999998E-5,4.6000500000000001E-5,4.6978299999999997E-5,5.0784400000000001E-5,3.3250000000000002E-5,3.1643700000000003E-5,6.0264099999999998E-5,4.1491500000000001E-5,5.9842100000000001E-5,3.6610599999999998E-5,4.0136499999999998E-5,4.4419399999999997E-5,2.8581E-5,5.2680699999999999E-5,5.38802E-5,3.3559700000000003E-5]
[null,null,null,788,-1.3470499999999999E-5,-2.1410799999999998E-5,-5.6893199999999996E-6,-1.98015E-5,-3.4432299999999999E-5,-1.1124800000000001E-5,-7.9062200000000003E-6,-1.4903200000000001E-6,-1.05398E-5,-1.6850600000000001E-5,-8.71095E-6,2.93864E-6,-1.8466900000000001E-5,4.0930399999999999E-6,-6.7921800000000002E-6,-5.5449500000000002E-6,9.5848700000000008E-7,3.39943E-6,-2.4221699999999999E-5,-3.0587499999999998E-5,1.9970200000000001E-5,-2.8347099999999998E-5,-6.9479E-6,-2.5661100000000002E-6,-1.85621E-5,-1.9505799999999999E-5,-1.9474300000000001E-5,-1.1483399999999999E-6,-1.0609699999999999E-6,7.19778E-7,2.2563700000000001E-6,-4.14639E-6,1.37267E-5,-4.5340199999999998E-6,-9.0852799999999995E-6,-1.03404E-5,-1.37407E-5]
[null,null,null,789,7.67427E-6,3.1501200000000003E-5,4.2058100000000003E-5,4.1184499999999998E-5,5.3446499999999997E-5,3.7641400000000002E-5,6.2652599999999997E-5,2.39503E-5,3.7173599999999999E-5,5.41213E-5,1.9758800000000001E-5,2.6415400000000001E-5,1.44635E-5,2.2752099999999999E-5,2.2512699999999999E-5,2.29009E-5,2.00533E-5,3.36448E-5,1.3685399999999999E-5,2.1108399999999999E-5,3.95567E-5,9.1437199999999999E-6,3.0850299999999998E-5,3.1860199999999997E-5,3.64384E-5,3.7270000000000001E-5,3.7939099999999997E-5,4.5427899999999999E-5,2.61305E-5,3.5622800000000001E-5,3.9232E-5,3.2706700000000003E-5,3.9048899999999998E-5,1.9695799999999999E-5,1.9562300000000001E-5,2.20773E-5,1.7065700000000002E-5]
[null,null,null,790,-9.9544799999999996E-6,1.32042E-5,4.7887800000000001E-6,9.3301500000000008E-6,4.6014700000000003E-6,-4.2122299999999996E-6,1.70327E-5,5.7998099999999998E-6,4.1860600000000002E-6,1.6027300000000002E-5,-1.1209199999999999E-5,3.4821800000000002E-6,1.0003000000000001E-5,-1.47727E-6,-1.4674999999999999E-5,-1.2881800000000001E-6,-9.4135099999999996E-6,1.3613300000000001E-5,-2.28472E-6,-7.5834699999999999E-6,8.0917799999999996E-6,-1.43915E-6,9.6975300000000003E-6,1.06338E-5,4.7669299999999996E-6,9.7319700000000006E-6,1.6802800000000001E-5,-1.32777E-5,-6.5733299999999998E-6,1.2518799999999999E-5,-1.10811E-7,7.7045799999999993E-6,-7.6944099999999994E-6,6.5780399999999998E-6,-4.0420800000000001E-6,-1.2550300000000001E-5,-1.4085E-5]
[null,null,null,791,1.878E-5,2.2024499999999999E-5,1.17255E-5,2.90587E-5,8.8882599999999998E-6,7.9963199999999997E-6,1.41254E-5,1.3148200000000001E-5,1.0175499999999999E-5,3.5886600000000003E-5,2.1168000000000001E-5,1.345E-5,1.4652599999999999E-5,2.2277E-5,1.75318E-5,5.6251900000000001E-6,2.92147E-5,9.39325E-7,7.1277700000000002E-6,1.54936E-5,1.1713500000000001E-5,1.2698300000000001E-6,2.52654E-5,7.3922899999999997E-6,1.8381800000000001E-5,1.7379400000000002E-5,3.5265699999999997E-5,1.3294E-5,2.33417E-5,3.8701600000000002E-5,2.17006E-5,3.5253699999999998E-5,1.04262E-5,3.9849599999999999E-5,3.53845E-5,1.65907E-5,1.8738599999999999E-6]
[null,null,null,792,-2.9104100000000001E-5,-1.42134E-5,9.1307199999999996E-7,-1.09307E-5,-9.2732999999999998E-6,3.7556000000000001E-6,-7.8025500000000004E-6,-1.9888400000000001E-5,5.6238000000000003E-6,9.2869899999999997E-7,-1.9079399999999999E-5,-9.3466800000000001E-6,1.1224700000000001E-6,-6.6900499999999996E-6,-7.9912999999999992E-6,8.9086300000000001E-6,-1.7362200000000001E-5,-3.2990600000000001E-6,-1.1047500000000001E-5,-1.60111E-5,-2.5811600000000001E-6,2.3012399999999999E-6,-1.9272399999999999E-5,-8.91728E-7,1.8511700000000001E-5,-5.6981600000000005E-7,-1.04507E-5,1.07013E-5,-1.9352899999999999E-5,-1.2714E-6,9.4612899999999997E-6,1.3632799999999999E-5,1.4063800000000001E-5,-1.5848000000000001E-6,-5.13741E-6,-9.1842900000000005E-6,-2.6317099999999999E-5]
[null,null,null,793,9.3872799999999993E-6,2.0172900000000001E-5,1.7492100000000001E-5,2.0604399999999999E-5,3.9851799999999997E-5,3.3905000000000001E-5,4.2763599999999998E-5,2.1437399999999999E-5,3.5088800000000002E-5,2.7129100000000001E-5,7.1826200000000002E-6,3.7863500000000001E-5,4.1309900000000001E-6,1.3983E-5,1.78297E-5,2.93445E-5,1.4134199999999999E-5,2.9930400000000001E-5,1.99852E-5,1.7689900000000002E-5,2.1422700000000001E-5,2.56809E-5,1.8817900000000002E-5,2.7482099999999999E-5,3.8545399999999999E-5,2.52002E-5,2.8590700000000001E-5,1.8592100000000001E-5,5.22641E-5,3.3095300000000001E-5,2.9674699999999999E-5,3.6780099999999997E-5,2.7784999999999999E-5,2.2886300000000001E-5,1.3736E-5,1.6682500000000002E-5,3.4730000000000001E-5]
[null,null,null,794,3.1345900000000001E-5,2.62389E-5,2.2560599999999999E-5,2.105E-5,2.2854299999999999E-5,2.7905499999999999E-5,3.2122899999999997E-5,3.1074000000000001E-5,5.5560399999999997E-5,4.3714400000000003E-5,3.81412E-5,2.1956399999999999E-5,2.4434500000000001E-5,5.2745599999999999E-5,3.7700600000000003E-5,1.70911E-5,1.5985999999999999E-5,1.5605999999999999E-5,-8.2897499999999997E-7,2.4088699999999999E-5,1.7350199999999999E-5,2.08211E-5,2.6359800000000001E-5,3.7895300000000003E-5,1.49587E-5,3.2321699999999999E-5,4.2208E-5,4.24799E-5,3.4860100000000002E-5,2.8989E-5,3.5512000000000002E-5,4.3420800000000003E-5,4.2833600000000003E-5,1.50278E-5,3.4264300000000003E-5,2.5992599999999999E-5,2.0056900000000001E-5]
[null,null,null,795,-1.1229299999999999E-5,-4.8567800000000001E-6,-2.8462899999999999E-6,8.3322400000000007E-6,-2.1242200000000001E-6,6.7680399999999997E-6,-2.2805800000000001E-6,-6.7029400000000001E-6,7.4611499999999997E-6,6.48803E-6,8.5020999999999995E-6,-1.2581E-5,1.271E-5,5.1130500000000001E-6,5.18089E-6,3.4681299999999999E-6,-5.003E-7,-1.55431E-5,-1.25769E-5,-7.9498899999999992E-6,-7.7341400000000005E-6,-1.5636000000000001E-5,-1.0962799999999999E-5,2.0063100000000001E-5,8.44239E-6,1.49018E-5,1.44303E-5,6.2522799999999997E-6,-3.8372899999999998E-6,3.0682199999999998E-6,1.3318399999999999E-5,2.14114E-5,-3.9126200000000002E-6,-2.9297399999999999E-6,-8.3076600000000007E-6,-1.37092E-6,-1.2608E-5]
[null,null,null,796,3.2806699999999998E-6,-4.8868200000000001E-6,2.3174E-6,2.3612799999999999E-5,-1.7709200000000001E-7,-2.0270400000000002E-5,1.0046E-5,1.16931E-6,1.3886900000000001E-5,-1.89066E-5,1.6856800000000001E-6,1.3649799999999999E-5,1.68241E-5,1.46432E-6,5.3533400000000003E-6,4.22444E-6,1.4929000000000001E-5,-1.50525E-5,-1.43028E-5,-8.2275200000000001E-6,1.4266200000000001E-5,-6.3571499999999998E-6,2.53981E-5,2.6988100000000002E-6,-2.61026E-6,4.9447100000000001E-6,7.7575699999999997E-6,8.5110800000000003E-8,1.1403600000000001E-6,2.2526499999999999E-5,2.6519399999999999E-5,1.94229E-5,1.19641E-5,-5.1664999999999996E-6,-6.4724899999999996E-6,4.1954999999999999E-6,4.35431E-7]
[null,null,null,797,-2.06559E-5,-3.8530900000000001E-5,-1.9571599999999998E-6,-5.7249400000000003E-6,-1.81728E-5,-1.16389E-5,-1.2619000000000001E-5,-1.30714E-5,-1.2831700000000001E-6,-3.6903899999999997E-5,-4.7951299999999996E-6,-2.2637999999999999E-5,-1.81727E-5,-2.3074E-5,-2.9031900000000002E-6,-2.3354699999999999E-6,-3.7766999999999999E-5,-1.7536700000000001E-5,-1.52501E-5,-4.4347700000000002E-5,-3.2042200000000003E-5,-2.5476000000000001E-5,-1.78251E-5,-2.23172E-5,4.5802699999999996E-6,-2.4578599999999999E-5,-2.2819900000000002E-5,-3.3415399999999999E-5,-9.0315899999999994E-6,-2.9760999999999998E-5,-3.8329000000000002E-6,-1.57439E-5,-1.62771E-5,-4.4010700000000002E-5,-5.2771800000000002E-5,-3.4172199999999998E-5,8.2093499999999996E-6]
[null,null,null,798,-3.0865399999999998E-5,-6.8983100000000004E-6,-3.0323499999999999E-5,-1.9244799999999999E-5,-1.5389100000000001E-5,-1.4181299999999999E-5,-4.1393300000000002E-8,-1.41223E-5,-1.1532099999999999E-5,-2.51383E-5,-1.5759700000000001E-5,-2.65197E-5,-9.0410300000000007E-6,-1.9916599999999998E-5,-2.25907E-5,-1.51553E-5,-2.8341199999999999E-5,-2.8592799999999998E-5,-3.3552400000000001E-5,-2.4193899999999999E-5,-1.8900099999999999E-5,-2.0690999999999999E-5,-3.6593600000000001E-5,-2.7418100000000001E-5,-2.0112600000000001E-5,-2.87698E-5,-1.8667600000000001E-5,-3.1328200000000003E-5,-2.8759200000000001E-5,-2.22507E-5,-1.8281500000000001E-5,-4.5838799999999999E-5,-2.5496100000000001E-5,-2.5723899999999999E-5,-3.7945299999999997E-5,-2.8092199999999998E-5,-2.9482899999999999E-5]
[null,null,null,799,3.98782E-5,4.2633599999999998E-5,1.8109900000000001E-5,1.7830699999999999E-5,3.0292000000000001E-5,2.9864899999999999E-5,2.6653100000000001E-5,3.5731800000000002E-5,3.6990599999999998E-5,2.4399000000000001E-5,3.5699099999999998E-5,2.6299700000000002E-5,4.1746599999999998E-5,1.21412E-5,4.2880399999999997E-5,2.2465099999999999E-5,1.54284E-5,3.9296599999999999E-5,2.8354899999999999E-5,2.6169999999999998E-5,3.0543799999999997E-5,1.9304400000000001E-5,1.08349E-5,3.6679700000000001E-5,3.4489999999999997E-5,1.7751899999999999E-5,3.3183799999999999E-5,1.4321100000000001E-5,2.3022599999999999E-5,3.6307299999999997E-5,4.1537800000000001E-5,2.8345300000000001E-5,3.4128000000000003E-5,2.41851E-5,1.50191E-5,4.7877799999999998E-5,2.6253899999999999E-5]
[null,null,null,800,4.3687599999999998E-5,6.5075300000000004E-5,4.7850599999999999E-5,3.9000600000000001E-5,4.2898000000000002E-5,3.5447200000000002E-5,6.4315900000000005E-5,5.2506700000000003E-5,4.7120200000000003E-5,5.5396000000000003E-5,3.8819300000000003E-5,4.51252E-5,3.6668100000000002E-5,3.5524700000000002E-5,4.5711699999999998E-5,4.7644700000000001E-5,4.39697E-5,2.7812499999999998E-5,4.9933299999999998E-5,5.7902400000000003E-5,3.3367200000000001E-5,4.2540000000000003E-5,4.70166E-5,4.1977400000000002E-5,3.2981600000000003E-5,4.4752700000000003E-5,4.5770599999999998E-5,4.7117499999999997E-5,4.0112399999999999E-5,5.1506199999999998E-5,3.9885500000000003E-5,4.7878199999999998E-5,5.4713899999999998E-5,3.75417E-5,5.0922299999999999E-5,5.1644899999999997E-5,3.7582400000000001E-5]
[null,null,null,801,5.9150000000000001E-6,-3.1206700000000001E-6,-1.9071599999999999E-5,3.0205900000000001E-6,-1.46183E-5,-4.4330299999999998E-5,-1.7663300000000001E-5,-1.3449699999999999E-5,1.6766899999999999E-6,-2.60361E-5,-1.0969E-5,-1.26775E-5,-3.80405E-6,4.7594800000000002E-6,4.1835900000000002E-6,-7.6272700000000002E-6,-1.4046199999999999E-5,1.2469900000000001E-5,-1.05404E-5,-1.08989E-5,-2.0287499999999998E-5,2.25072E-6,-2.8760800000000001E-5,-1.15393E-5,-8.0671299999999998E-6,-1.51998E-5,-8.9959400000000008E-6,5.9603299999999999E-6,-1.8703300000000001E-5,-9.7532000000000001E-6,2.2194599999999999E-5,-2.04366E-5,-1.6066199999999999E-6,-1.6003800000000001E-5,-1.9936599999999998E-6,6.7119799999999997E-6,-1.2324600000000001E-5]
[null,null,null,802,-3.4154500000000001E-6,5.6970900000000002E-6,5.8508300000000004E-6,9.1687400000000002E-6,-1.2646000000000001E-5,-1.26649E-6,2.2329700000000001E-6,1.1303399999999999E-5,1.40457E-5,1.19335E-6,7.8486499999999998E-6,1.11328E-5,9.2952599999999995E-6,-3.25119E-6,6.0852200000000003E-6,-1.24078E-5,-1.7217299999999999E-5,-2.9441099999999998E-5,-1.7073799999999999E-5,-8.0749100000000002E-6,-1.18802E-6,-1.33781E-5,-1.7352099999999999E-5,-1.03328E-5,1.15902E-5,-1.93752E-5,-1.6629500000000001E-6,1.32842E-6,2.2938800000000001E-5,4.5682700000000004E-6,-4.9427199999999998E-6,-5.3521E-6,-1.6217599999999999E-5,-1.95374E-5,-1.31549E-5,2.2884099999999998E-6,-1.79766E-5]
[null,null,null,803,4.7013100000000001E-6,1.3303699999999999E-5,2.06112E-5,2.67394E-5,1.7942099999999999E-5,2.9497800000000001E-5,3.2098799999999998E-5,4.37966E-5,2.9862500000000001E-5,2.6598199999999999E-5,8.1257099999999998E-6,3.17628E-5,3.4546199999999998E-5,2.8295800000000001E-5,1.1920799999999999E-5,1.16654E-5,1.3303699999999999E-5,1.96346E-5,1.73506E-5,-2.2914199999999999E-6,1.12729E-5,1.0349100000000001E-5,6.7298499999999996E-6,3.4509599999999999E-5,4.80892E-5,3.1191700000000002E-5,2.7163300000000001E-5,1.02204E-5,3.6338199999999997E-5,2.1024000000000001E-5,2.0886600000000001E-5,1.9718899999999999E-5,2.6690300000000001E-5,2.4552499999999999E-6,2.6204299999999999E-5,1.579E-5,6.6521000000000002E-6]
[null,null,null,804,-6.7098900000000003E-7,2.74862E-6,4.01601E-6,5.7971099999999998E-6,2.2052499999999999E-5,2.2283700000000001E-5,1.9102799999999999E-5,2.02094E-5,4.8434899999999996E-6,1.8862799999999998E-5,-7.1222500000000003E-6,2.0717299999999999E-5,1.2652599999999999E-6,1.04006E-5,1.0021500000000001E-5,7.2863400000000003E-6,1.0827E-5,6.3520999999999997E-6,1.25841E-5,-3.65748E-6,3.50232E-6,-2.6780699999999998E-7,1.24782E-5,-8.2159099999999996E-7,3.2423199999999998E-5,2.2455699999999999E-5,2.42947E-5,1.86642E-5,1.3105800000000001E-5,1.80754E-5,1.00628E-5,1.98101E-6,6.4520600000000002E-6,7.8886400000000004E-6,-3.57021E-6,3.4221400000000001E-6,1.8231900000000001E-5]
[null,null,null,805,1.0808100000000001E-5,6.5598700000000001E-6,-1.10727E-5,2.4967400000000001E-5,1.22419E-5,-9.2289700000000005E-6,-7.6011900000000003E-6,2.3086199999999999E-5,8.8817600000000008E-6,7.7197300000000004E-6,2.3102700000000002E-5,2.7648699999999998E-5,1.41902E-5,7.8269699999999994E-6,2.8632400000000001E-5,1.74744E-5,1.5471599999999999E-5,-3.4271900000000001E-6,-8.5129900000000006E-6,1.5072000000000001E-5,-1.3998200000000001E-6,2.28793E-5,7.2736699999999999E-6,-9.3483699999999997E-6,4.2666300000000003E-6,2.5732600000000002E-5,2.8687000000000002E-5,3.8000200000000002E-6,2.8379000000000001E-5,4.6469700000000002E-6,5.1198100000000004E-6,4.3698199999999998E-6,8.5067699999999992E-6,-3.9402599999999999E-6,1.12585E-6,-1.47578E-5,-6.6433700000000002E-6]
[null,null,null,806,1.4532799999999999E-5,3.1334600000000003E-5,5.52125E-5,3.4290099999999999E-5,5.0980799999999998E-5,4.4533999999999997E-5,3.5939799999999998E-5,4.4036199999999997E-5,6.3498199999999995E-5,4.7036300000000002E-5,5.8474499999999997E-5,4.2658299999999998E-5,4.3994800000000001E-5,5.3732700000000001E-5,4.2582E-5,4.3807000000000003E-5,4.3785400000000003E-5,5.8669999999999999E-5,2.8620100000000001E-5,4.9645799999999998E-5,4.4879999999999997E-5,4.2122600000000002E-5,6.0063799999999999E-5,5.3205199999999997E-5,2.6706499999999999E-5,4.9358199999999998E-5,4.7743800000000002E-5,4.6477000000000002E-5,5.2051700000000002E-5,4.5022799999999999E-5,4.4505300000000002E-5,3.2538700000000001E-5,2.8229200000000001E-5,4.0349499999999997E-5,3.3858500000000001E-5,4.65316E-5,3.1117800000000002E-5]
[null,null,null,807,2.2992500000000001E-5,1.3239599999999999E-5,2.4519200000000001E-5,1.8824399999999999E-5,3.1294400000000003E-5,2.2005899999999999E-5,2.0060399999999999E-5,2.5434499999999998E-5,2.9412800000000001E-5,1.6075699999999999E-5,2.1706699999999998E-6,2.5242999999999999E-5,1.37875E-5,6.32279E-6,2.5531999999999999E-5,3.6680900000000001E-7,7.3518399999999999E-6,7.8970999999999993E-6,2.85178E-5,1.9381E-5,7.7737699999999996E-6,8.5674599999999995E-6,5.3044999999999998E-6,1.3795600000000001E-5,6.4246600000000003E-6,2.55895E-5,3.3429100000000002E-5,-2.08853E-6,2.9470300000000001E-5,-4.0046599999999998E-7,3.7573700000000002E-5,-5.4153399999999999E-6,3.02439E-5,1.6080099999999999E-5,-1.9477999999999998E-6,2.1724899999999999E-5,-5.5021299999999998E-7]
[null,null,null,808,8.3017000000000005E-6,2.01706E-5,3.3915299999999997E-5,3.45379E-5,2.0995399999999999E-5,1.86225E-5,3.5403700000000001E-5,1.41374E-5,3.0419199999999998E-5,1.7072399999999999E-5,2.43056E-5,3.3534100000000001E-5,3.5448699999999998E-5,2.7482199999999999E-5,2.99316E-5,1.0700799999999999E-5,8.78399E-7,2.6648800000000001E-5,2.5995699999999999E-5,6.5332900000000001E-7,2.35919E-5,1.64606E-5,8.6926799999999992E-6,3.3502099999999999E-5,1.5168600000000001E-5,3.35364E-5,2.41125E-5,9.6795999999999996E-6,3.0984E-5,1.8801499999999999E-5,1.04747E-5,2.0091599999999999E-5,2.4324500000000001E-5,1.6082E-5,2.7013100000000001E-5,1.04286E-5,1.31942E-5]
[null,null,null,809,-6.3220200000000003E-6,1.4219800000000001E-5,2.81468E-5,2.1508299999999999E-5,9.5635400000000003E-6,1.41104E-5,1.02748E-5,2.3967800000000001E-5,1.14514E-5,1.0705200000000001E-6,1.9762099999999998E-5,9.9604700000000002E-6,-2.0153200000000001E-7,-9.3392099999999993E-6,2.1059900000000001E-5,7.9807399999999995E-7,-1.6155799999999999E-5,-1.7791500000000001E-5,-2.0765900000000001E-5,-1.8309600000000001E-6,-7.5933399999999996E-7,1.1319500000000001E-5,-5.14342E-8,2.3360700000000001E-5,2.5649699999999999E-5,1.79244E-6,-1.35622E-5,1.9969100000000002E-5,8.8899499999999995E-6,2.8822199999999998E-6,3.7531300000000001E-6,1.80169E-5,6.0979100000000004E-6,-4.3783799999999997E-6,5.54232E-6,-2.46056E-6,-3.6168299999999998E-6]
[null,null,null,810,-1.4425699999999999E-7,-1.5674600000000001E-5,4.0578100000000002E-6,-3.1452700000000002E-6,-1.30244E-5,9.0226200000000001E-8,4.9042399999999998E-6,1.4351900000000001E-5,2.0819099999999999E-5,-7.5491399999999997E-6,-5.4895700000000004E-6,-4.4508699999999996E-6,-8.2020700000000002E-6,-1.6626800000000001E-5,-1.7622299999999999E-5,-1.73446E-5,1.6884900000000002E-5,1.20362E-5,8.8693199999999996E-6,2.38779E-6,-6.4599200000000003E-6,5.0516199999999998E-8,-1.1606900000000001E-5,8.1226499999999992E-6,6.3483400000000003E-7,1.5054299999999999E-5,-5.8431800000000003E-7,-2.247E-5,-6.3834899999999997E-7,4.3787400000000004E-6,-5.2226699999999996E-6,4.9522499999999999E-6,-2.13652E-5,-1.9660199999999999E-5,-1.0344599999999999E-5,3.6898799999999999E-6,-2.8039999999999999E-5]
[null,null,null,811,-1.3922499999999999E-5,-1.6238900000000001E-5,-1.0482000000000001E-5,-1.99033E-5,-8.7916299999999994E-6,-1.13216E-5,-3.6893900000000003E-5,-1.2266799999999999E-5,6.3237899999999996E-6,-3.98827E-6,-5.6601100000000001E-6,-7.7458600000000004E-6,-1.7101200000000002E-5,-4.8515699999999999E-6,-1.05591E-5,-1.5630399999999999E-5,5.22982E-6,-1.7201600000000001E-5,-2.90047E-6,-1.6534499999999999E-5,-9.2649100000000007E-6,-1.59074E-5,-1.3065500000000001E-5,-2.4164599999999999E-5,-1.2658E-5,-3.6207599999999999E-6,-1.06372E-5,-1.58491E-5,-6.6937199999999997E-6,-1.09328E-5,-7.1411999999999999E-7,-9.6559300000000006E-6,7.6426599999999994E-6,-2.1291799999999998E-5,-6.7719999999999997E-6,-1.46778E-5,-2.9050199999999998E-5]
[null,null,null,812,-3.2876899999999997E-5,-2.2389900000000001E-5,-3.6193899999999999E-5,-2.2580799999999999E-5,-3.02254E-5,-3.6660299999999999E-5,-1.8966599999999999E-5,-4.0241000000000003E-5,-1.51442E-5,-2.0091299999999999E-5,-2.7432399999999998E-5,-2.3669300000000001E-5,-3.10148E-5,-1.9277900000000001E-5,-2.3697699999999998E-5,-3.4917699999999999E-5,-4.1766700000000001E-5,-5.44894E-5,-1.77477E-5,-3.5735499999999997E-5,-2.5911899999999998E-5,-2.4685499999999999E-5,-2.8260699999999999E-5,-4.0424199999999998E-5,-3.3078699999999999E-5,-3.20777E-5,-1.12936E-5,-3.2014799999999997E-5,-1.0870700000000001E-5,-1.83039E-6,-2.4318E-5,-1.59044E-5,-2.64703E-5,-3.0224599999999999E-5,-9.3429100000000006E-6,-3.0249399999999999E-5,-3.9654199999999997E-5]
[null,null,null,813,-2.35997E-5,-9.3276500000000004E-6,-1.8201300000000001E-5,-1.0939400000000001E-5,-5.0693099999999998E-6,-1.7107699999999999E-5,2.1192E-5,-7.9828299999999996E-6,-6.8974299999999998E-6,-1.86532E-5,-5.5410199999999997E-6,-2.9333199999999999E-5,-1.5167000000000001E-5,-1.34085E-5,-1.7692800000000001E-5,-1.8961799999999999E-5,-1.6390899999999999E-5,-3.1570199999999998E-5,-1.37491E-5,-3.5704300000000003E-5,-2.0742099999999999E-5,-3.3080200000000002E-5,-1.11885E-5,-3.0273900000000002E-5,-1.98014E-5,-2.8960500000000002E-5,-4.3764299999999997E-6,-3.3614700000000002E-5,-1.47403E-5,-9.3795299999999993E-6,-1.6206600000000002E-5,-3.2992199999999998E-6,-2.1562000000000001E-5,-3.2264500000000003E-5,-1.4539600000000001E-5,-9.9788800000000006E-6,-1.4309599999999999E-5]
[null,null,null,814,-4.3982900000000001E-7,-9.4694000000000003E-7,-1.4791699999999999E-5,7.7635499999999996E-6,-1.48735E-6,-7.7968499999999997E-6,1.5553499999999999E-5,-7.4687000000000002E-6,8.7410700000000001E-7,1.5698399999999999E-5,-8.0410300000000002E-6,-1.79814E-6,4.75622E-6,1.04587E-5,9.8183799999999993E-6,-1.2636999999999999E-5,-1.6294400000000001E-5,8.6300700000000002E-7,-2.28085E-5,-1.36949E-5,2.4336100000000002E-6,-2.09881E-5,-2.57784E-5,3.2244699999999998E-6,-1.1583899999999999E-5,1.39183E-5,-4.4211400000000002E-6,-7.5020100000000002E-6,1.8566299999999999E-5,-1.01417E-5,1.0716100000000001E-5,-1.14389E-5,2.9462700000000001E-6,-3.0874499999999997E-5,1.22076E-5,-2.0537899999999999E-5,-7.2855799999999996E-6]
[null,null,null,815,3.6807300000000002E-7,1.41522E-5,2.22591E-6,1.1984899999999999E-5,2.4484599999999999E-5,6.7821800000000003E-6,6.3073499999999998E-6,1.4973100000000001E-5,2.03021E-5,7.1728799999999998E-6,2.6449300000000001E-5,2.8743099999999999E-5,-3.2611499999999998E-7,1.9658599999999998E-5,1.1512899999999999E-5,2.31467E-5,1.1566199999999999E-5,1.5982E-5,4.1692400000000001E-5,1.5265200000000001E-5,7.1506300000000002E-6,2.0633899999999999E-5,8.5978200000000004E-7,1.42842E-5,1.3574699999999999E-6,3.0578499999999999E-5,3.12558E-5,1.22859E-5,1.49251E-5,9.5368399999999993E-6,2.9378199999999999E-5,-2.9852799999999999E-6,7.5438700000000003E-6,2.6392300000000001E-6,1.51922E-5,2.72912E-6,-5.2598199999999995E-7]
[null,null,null,816,3.3244799999999997E-5,3.7057400000000002E-5,3.9809399999999999E-5,5.0739199999999997E-5,5.59818E-5,4.4128999999999997E-5,2.9785E-5,3.1239699999999998E-5,5.38433E-5,5.2701000000000002E-5,4.7873100000000001E-5,3.4720600000000001E-5,1.8176799999999998E-5,4.2037899999999999E-5,3.1504699999999997E-5,4.8932399999999999E-5,4.1839599999999998E-5,5.3869599999999997E-5,4.1508599999999998E-5,3.6989600000000002E-5,2.13096E-5,5.0124299999999997E-5,4.3404400000000001E-5,5.0343699999999997E-5,3.3333800000000003E-5,4.5759800000000002E-5,5.9771500000000002E-5,2.2384200000000002E-5,3.4675100000000003E-5,3.9147899999999998E-5,3.9540399999999998E-5,4.8300000000000002E-5,4.6109000000000002E-5,2.1743099999999999E-5,3.7320600000000003E-5,3.6599900000000002E-5,3.6943999999999997E-5]
[null,null,null,817,1.1560600000000001E-5,1.7665799999999999E-5,-6.8724599999999996E-6,-2.5928999999999999E-7,5.9700499999999997E-6,-4.3624699999999998E-6,1.08927E-5,7.1725399999999998E-6,-2.7524300000000001E-6,4.7415100000000001E-6,5.72852E-6,8.1848399999999994E-6,-5.6289399999999998E-6,-1.69953E-5,1.5696400000000001E-5,2.82894E-6,6.5985200000000001E-6,1.67853E-5,8.5270199999999995E-7,-1.0631299999999999E-5,-1.06455E-5,1.0934800000000001E-5,2.02478E-5,-3.0775799999999998E-6,-2.4509399999999998E-7,9.1059200000000001E-7,2.06894E-6,-1.1587600000000001E-5,9.0371799999999999E-7,8.9785399999999999E-6,-5.5208099999999996E-6,2.6321900000000001E-6,1.0116600000000001E-5,5.4006999999999998E-6,2.5321700000000001E-6,1.9926099999999999E-5,-1.6775799999999999E-6]
[null,null,null,818,9.9343999999999993E-6,4.9884099999999999E-5,2.6617900000000001E-5,3.6439000000000001E-5,3.0969900000000003E-5,2.0596999999999999E-5,4.0213799999999998E-5,2.0307899999999999E-5,2.6216599999999999E-5,4.4855499999999998E-5,4.2521999999999997E-5,1.2142E-5,2.1499900000000001E-5,2.6656300000000001E-5,1.16902E-5,3.8445699999999997E-5,2.8586599999999998E-5,4.28229E-5,3.7203899999999998E-5,5.5091099999999998E-5,2.6919000000000001E-5,2.5475900000000001E-5,2.2012900000000001E-5,-3.3729299999999999E-6,2.34065E-5,1.6532699999999998E-5,3.2224500000000003E-5,1.77372E-5,3.6551499999999997E-5,3.1784800000000001E-5,4.3852E-5,2.2453500000000001E-5,3.6852199999999999E-5,2.06589E-5,1.6846100000000001E-5,2.5123800000000002E-5,2.05588E-5]
[null,null,null,819,4.28602E-5,4.9392199999999998E-5,3.11105E-5,3.5434800000000002E-5,1.5454599999999999E-5,2.9079699999999999E-5,5.3635399999999998E-5,4.4147499999999997E-5,3.7587699999999999E-5,2.40245E-5,2.02218E-5,4.5266599999999998E-5,2.5393099999999999E-5,3.8736299999999997E-5,5.0567199999999999E-5,4.9149700000000001E-5,2.5833599999999999E-5,2.3618400000000001E-5,2.0429200000000001E-5,3.4038600000000003E-5,6.1753099999999997E-5,-8.8286500000000006E-6,1.4336E-5,5.47085E-5,3.97264E-5,1.5170900000000001E-5,3.8524099999999999E-5,2.7977300000000001E-5,5.08271E-5,7.1700300000000002E-5,4.9743100000000002E-5,4.6053600000000002E-5,2.3433799999999999E-5,3.5942300000000003E-5,3.13116E-5,4.7961699999999999E-5,3.0222700000000001E-5]
[null,null,null,820,2.2410699999999999E-5,4.0102699999999998E-5,2.97835E-5,3.8868600000000003E-5,1.7572799999999999E-5,4.0754000000000003E-5,2.18753E-5,3.3267299999999999E-5,2.8146200000000002E-5,3.4524099999999997E-5,3.4575800000000002E-5,3.9926499999999998E-5,1.67576E-5,4.0405999999999999E-5,1.5528000000000001E-5,4.9214300000000001E-5,3.5902799999999998E-5,3.6422499999999999E-5,3.63735E-5,3.3537300000000002E-5,3.38054E-5,2.9077E-5,-4.5662600000000004E-6,2.5985800000000001E-5,3.7008000000000002E-5,3.35644E-5,4.2773299999999999E-5,2.9399499999999999E-5,5.2417699999999998E-5,3.7083399999999998E-5,2.0843699999999998E-5,1.3668200000000001E-5,2.5967400000000001E-5,1.26428E-5,6.2096499999999999E-6,2.1883999999999999E-5,5.0816099999999996E-6]
[null,null,null,821,1.8754700000000001E-7,-9.5167899999999994E-6,1.1652599999999999E-5,-5.8930400000000004E-6,-2.35981E-5,-8.9718499999999995E-6,-6.3854300000000003E-6,-8.3839900000000007E-6,-7.3868400000000004E-6,-1.11262E-5,-9.7331699999999999E-6,6.1787300000000002E-6,-2.4687900000000001E-5,8.7234800000000007E-6,1.3921E-6,1.2565799999999999E-5,-3.8910200000000002E-6,-2.4234099999999999E-5,-1.1188100000000001E-5,-1.48406E-5,-6.2902000000000004E-6,-2.12617E-5,-2.72785E-5,-1.8704099999999999E-5,-1.5992299999999999E-5,-8.2182599999999995E-6,-1.5029699999999999E-5,-2.3171900000000002E-6,-5.6116699999999996E-6,-9.62415E-6,-1.23003E-5,-1.64051E-5,-7.4508800000000004E-6,-3.6036399999999999E-5,-3.3652799999999997E-5,-2.51802E-5,-1.70757E-5]
[null,null,null,822,-5.5967899999999997E-7,8.0226199999999998E-6,-6.0972499999999999E-6,1.5821899999999998E-5,-2.71611E-6,7.2172799999999998E-6,8.1807600000000003E-6,1.8777899999999999E-5,1.04354E-5,1.14044E-5,1.34639E-5,1.29655E-5,-3.2132399999999998E-6,7.5912600000000002E-6,-1.49913E-5,1.10719E-5,-1.5026E-5,-1.5353600000000002E-5,-7.0124400000000002E-6,-7.1197099999999996E-6,1.5727300000000001E-5,4.66094E-6,1.2082999999999999E-5,-1.2328599999999999E-5,-4.7798399999999998E-6,2.3564899999999999E-5,-1.9350699999999999E-6,-1.45835E-6,1.5353600000000002E-5,-7.8061100000000004E-6,-1.1753099999999999E-5,-1.6970099999999999E-5,-8.4014500000000007E-6,-6.0800600000000002E-6,-2.5040400000000002E-5,-1.9790900000000001E-5,-1.42265E-5]
[null,null,null,823,5.85869E-5,8.3210500000000006E-5,6.0610599999999999E-5,5.6485900000000001E-5,7.8959299999999995E-5,7.6542099999999993E-5,5.5612300000000003E-5,6.7589799999999994E-5,5.2116900000000002E-5,1.82546E-5,6.4638699999999995E-5,6.0602500000000001E-5,3.7712700000000002E-5,6.4035599999999994E-5,2.9991299999999999E-5,3.7830999999999997E-5,4.77184E-5,5.3143200000000003E-5,3.3880700000000002E-5,5.8823100000000003E-5,6.7120900000000003E-5,4.5352300000000003E-5,4.4979599999999999E-5,4.4073299999999997E-5,6.0055900000000002E-5,5.1918500000000001E-5,6.3052200000000006E-5,6.09079E-5,5.1725599999999998E-5,7.4944900000000001E-5,6.9546699999999996E-5,4.32373E-5,5.9683199999999998E-5,3.0227599999999998E-5,5.1910399999999997E-5,6.6155999999999995E-5,5.7547000000000003E-5]
[null,null,null,824,-1.35109E-5,-2.0299899999999999E-5,-1.22778E-5,-1.0985000000000001E-5,-4.5020600000000002E-6,-1.8947600000000001E-5,-9.5077099999999995E-6,2.4428600000000001E-6,7.4642700000000003E-6,-3.4175899999999998E-6,4.06213E-6,2.7684800000000001E-6,1.1220100000000001E-6,-1.99901E-5,-9.3600500000000003E-6,-9.4461799999999997E-6,-2.91639E-5,1.0302800000000001E-5,-1.6810799999999998E-5,-2.3527200000000001E-5,-2.0616400000000001E-5,1.63002E-6,-1.4787899999999999E-5,-3.0486700000000001E-5,-6.7748699999999997E-6,-1.1817800000000001E-5,-1.91849E-5,-7.6151199999999999E-6,-2.1545699999999999E-5,1.0642900000000001E-6,-7.9376199999999997E-6,-1.23554E-5,-2.78273E-5,-7.1765699999999996E-6,-1.66047E-5,-9.3319499999999997E-6,-2.18984E-5]
[null,null,null,825,1.6160299999999998E-5,1.43909E-5,2.09665E-5,1.9774100000000001E-5,2.5810399999999999E-5,3.0312799999999999E-5,2.3918600000000002E-5,3.3785899999999998E-5,3.3156900000000001E-5,3.5297699999999999E-5,4.4703100000000002E-5,2.9362699999999999E-5,3.4417900000000001E-5,1.7624600000000001E-5,3.2778799999999999E-5,5.03598E-6,1.33374E-5,2.6026699999999999E-5,1.49023E-5,1.3688499999999999E-5,1.50662E-5,2.4533300000000001E-5,2.81394E-5,1.8448699999999998E-5,1.39492E-5,3.0770199999999999E-5,2.00472E-5,1.3839099999999999E-5,3.2082300000000003E-5,3.4069400000000003E-5,3.85893E-5,2.57861E-6,8.6671200000000001E-6,2.65275E-5,2.2960000000000001E-6,2.4000599999999999E-5,7.6955900000000006E-6]
[null,null,null,826,-2.0263099999999999E-5,9.0050499999999994E-6,-2.0135900000000001E-5,1.8579700000000001E-6,-4.6139300000000004E-6,2.05654E-6,-1.5871599999999999E-5,7.3795399999999997E-6,-5.4397800000000003E-6,-2.3505600000000002E-6,-1.6427300000000001E-5,8.9227199999999998E-6,4.2034999999999996E-6,1.0987300000000001E-5,4.2349700000000002E-7,-1.5106000000000001E-5,-3.1856200000000002E-5,-3.3285799999999999E-5,-1.11678E-5,-1.9066300000000001E-5,-1.0545400000000001E-5,-2.0540899999999998E-5,2.5487499999999999E-6,-1.05251E-5,-1.1745200000000001E-5,-1.9678E-5,1.0281100000000001E-5,-2.6567299999999999E-5,4.8462100000000001E-6,1.1665600000000001E-5,8.0175799999999996E-6,-9.2379399999999999E-7,-1.79E-6,-4.4553600000000003E-6,-1.33038E-5,7.7770399999999997E-6,-2.4484000000000001E-5]
[null,null,null,827,3.4285300000000002E-5,5.0455100000000001E-6,5.3426600000000003E-6,-1.02257E-6,4.80481E-6,1.4653300000000001E-5,2.4969499999999999E-5,3.10643E-5,5.2843299999999999E-6,6.8212099999999999E-6,3.4048299999999997E-5,7.6049499999999999E-6,1.48939E-5,3.2864000000000002E-5,1.73664E-5,-2.2283999999999999E-5,2.03546E-5,2.9747499999999999E-5,1.26467E-5,8.5433399999999994E-6,7.2871299999999996E-6,1.13773E-5,2.3903199999999998E-5,1.31394E-5,9.7356200000000001E-6,-8.1239200000000004E-7,3.0613500000000001E-5,1.83368E-5,3.0554700000000001E-5,1.88295E-5,1.6634899999999999E-5,-5.1075699999999996E-6,-5.1715100000000002E-6,-1.8694999999999998E-9,2.2167500000000001E-5,-1.01512E-5,-1.1996E-5]
[null,null,null,828,1.82881E-6,1.44043E-5,-7.5060300000000002E-6,2.49082E-5,5.1291200000000003E-6,1.0276600000000001E-6,1.0990899999999999E-6,-1.6444599999999999E-7,9.5559100000000001E-6,2.1291400000000001E-5,1.08417E-5,4.8122999999999996E-6,1.27646E-5,1.5898700000000001E-5,7.4449700000000003E-6,-1.2242800000000001E-5,-7.74428E-6,-9.7820799999999994E-6,-1.5891899999999999E-6,7.9073600000000005E-6,2.3889800000000002E-6,1.2911800000000001E-5,-7.2383499999999999E-6,-8.9572999999999998E-6,-3.3226000000000002E-6,5.3121100000000002E-6,1.8493000000000001E-5,1.90567E-6,4.1793500000000001E-6,5.5035900000000003E-6,6.8490900000000004E-6,-1.47525E-6,2.0859300000000002E-6,-3.3253199999999999E-6,-1.1588599999999999E-5,-2.65121E-6,-1.1944900000000001E-6]
[null,null,null,829,4.9371200000000003E-6,3.0787600000000003E-5,2.9311299999999998E-5,3.1367400000000001E-5,3.56905E-5,1.5761300000000001E-5,2.8761199999999998E-5,1.56063E-5,1.67187E-5,3.7715900000000003E-5,1.6692099999999999E-5,2.6019900000000001E-5,2.2398599999999999E-5,3.47976E-5,1.62848E-5,2.4709400000000001E-5,1.31867E-5,1.85359E-5,3.0781000000000002E-5,3.2317300000000003E-5,1.8782699999999999E-5,3.0418900000000001E-5,1.48646E-5,1.3504599999999999E-5,1.5349499999999999E-5,4.2367499999999997E-5,2.7467500000000001E-5,1.8496999999999999E-5,2.3235200000000001E-5,1.8739599999999999E-5,3.1853500000000003E-5,1.8007800000000001E-5,3.36662E-5,2.4770499999999999E-5,1.5381599999999999E-5,2.6152500000000001E-5,1.49643E-5]
[null,null,null,830,-1.2117699999999999E-5,-1.17949E-6,1.38803E-5,-3.48455E-6,-8.4130500000000007E-6,2.3606000000000001E-5,-6.5380699999999997E-6,5.8833400000000003E-6,-1.7250899999999999E-6,-1.7618400000000001E-6,-3.0918600000000002E-6,6.9754799999999998E-6,-1.8784699999999999E-6,1.4875899999999999E-5,6.7581300000000001E-6,1.28265E-5,-1.5885699999999999E-6,2.4442000000000001E-5,-6.9307600000000004E-6,1.92174E-5,4.15506E-6,-4.7709700000000002E-6,1.1481199999999999E-5,2.49733E-5,-1.3645899999999999E-5,1.62288E-5,1.8474999999999998E-5,1.27023E-5,9.0105299999999999E-6,8.8075E-6,1.75501E-5,-9.5829999999999996E-6,6.2688699999999998E-6,-9.7051999999999998E-6,-1.2475499999999999E-5,3.6352700000000002E-5,1.24634E-5]
[null,null,null,831,6.3682299999999998E-5,7.5358599999999994E-5,1.05615E-4,8.0419699999999998E-5,6.2214799999999999E-5,8.1609599999999999E-5,8.1325599999999999E-5,7.2939400000000002E-5,6.1018499999999999E-5,9.0403700000000003E-5,8.1238999999999999E-5,8.5249999999999999E-5,9.4155199999999996E-5,6.1376299999999997E-5,7.2973100000000001E-5,9.4512999999999994E-5,6.9027699999999996E-5,6.1138500000000004E-5,6.9913799999999995E-5,5.5893600000000003E-5,6.6973399999999998E-5,5.5033800000000002E-5,8.1742000000000004E-5,6.1898199999999996E-5,7.4855600000000002E-5,7.4651499999999995E-5,6.7615599999999997E-5,8.4569799999999998E-5,9.2094899999999998E-5,7.0614500000000006E-5,7.7809400000000001E-5,7.5159800000000005E-5,6.6768599999999996E-5,8.9524799999999994E-5,6.6616699999999995E-5,7.2344399999999998E-5,8.9895400000000007E-5]
[null,null,null,832,5.0416E-5,2.9845500000000001E-5,2.0551500000000001E-5,3.3198399999999997E-5,4.0119499999999998E-6,2.71071E-5,2.1954300000000001E-5,1.2384299999999999E-5,1.10922E-5,1.47826E-5,3.0715300000000001E-5,4.1201700000000002E-5,1.2578100000000001E-5,2.7038699999999999E-5,2.99084E-5,1.4581499999999999E-5,2.7358000000000001E-5,3.6242699999999998E-5,-8.2699800000000007E-6,2.2989700000000001E-5,3.1136900000000003E-5,5.16245E-6,2.11412E-5,1.85578E-5,1.6838899999999999E-5,1.8765300000000001E-5,2.7762800000000001E-5,1.22919E-5,2.3407199999999998E-5,4.0562899999999997E-5,3.2085000000000002E-5,2.1682500000000001E-5,2.06237E-5,2.7967199999999999E-5,2.8254200000000001E-5,3.0946199999999999E-5,3.7989399999999999E-5]
[null,null,null,833,1.51969E-5,1.5874799999999999E-5,1.9852900000000001E-5,2.3962099999999999E-5,2.8643300000000001E-5,1.58242E-5,1.5263600000000001E-5,3.2946199999999999E-6,1.6543300000000001E-5,1.7343999999999999E-5,2.4160800000000001E-5,3.4378999999999997E-5,1.9984999999999999E-5,1.2927E-5,1.7608199999999999E-5,2.8561700000000001E-5,8.8891299999999997E-6,2.6502000000000001E-5,1.3595600000000001E-5,8.3423300000000001E-6,3.1167100000000002E-5,4.99825E-6,2.3340600000000001E-5,2.0738600000000002E-5,2.07949E-5,1.1280400000000001E-6,3.3503700000000002E-5,2.8699599999999999E-5,1.6727100000000001E-5,1.94692E-5,1.7965499999999999E-5,7.8012799999999996E-6,9.1797499999999997E-6,3.1396799999999997E-5,-5.5488200000000001E-7,2.6097599999999999E-5,2.9774800000000002E-5]
[null,null,null,834,-8.8880200000000002E-7,4.5704299999999999E-6,4.5938599999999999E-6,1.4865099999999999E-5,2.0665500000000001E-5,5.5612399999999996E-6,-3.66845E-6,1.00145E-5,1.3810400000000001E-5,9.0466599999999999E-6,2.0586900000000001E-5,7.3037000000000001E-6,3.8773500000000002E-6,7.9206399999999994E-6,1.09443E-5,1.5547900000000001E-5,4.3029599999999999E-6,3.3755999999999999E-6,9.0647100000000005E-6,1.40627E-5,1.57158E-5,9.5562199999999998E-6,5.7476900000000002E-6,2.37048E-5,1.14466E-5,-7.5150400000000003E-6,1.47153E-5,2.27526E-5,1.3843600000000001E-5,8.1627299999999993E-6,3.13731E-5,1.2995300000000001E-5,-4.2951699999999997E-8,6.6672399999999997E-6,-2.0328700000000001E-6,1.2082999999999999E-5,1.0460599999999999E-5]
[null,null,null,835,2.78504E-5,3.6214699999999997E-5,4.1038899999999998E-5,3.7377300000000002E-7,4.9645099999999997E-5,4.2995899999999999E-5,4.4174500000000002E-5,4.5207899999999998E-5,4.07311E-5,4.4715400000000002E-5,1.6574699999999999E-5,5.4350700000000001E-5,5.9091300000000001E-5,6.5964900000000003E-5,5.5216999999999997E-5,3.3448499999999997E-5,5.9095699999999997E-5,3.4767900000000003E-5,6.0969099999999999E-5,5.01069E-5,5.0823699999999999E-5,4.1966799999999999E-5,5.3603000000000002E-5,5.8123800000000001E-5,5.2169400000000002E-5,6.2442399999999997E-5,4.1043300000000001E-5,2.54228E-5,4.6096200000000001E-5,5.8488800000000001E-5,4.9851800000000003E-5,6.2451099999999996E-5,7.8999500000000001E-5,5.7728E-5,4.11665E-5,5.6356E-5,6.3977099999999994E-5]
[null,null,null,836,3.9227699999999997E-5,2.4016399999999999E-5,2.9712700000000001E-5,2.94339E-5,1.7824499999999998E-5,2.9926699999999999E-5,4.7573E-5,3.9227699999999997E-5,4.5466700000000003E-5,1.6589600000000001E-5,2.5117799999999999E-5,3.9843199999999998E-5,3.9712899999999997E-5,3.9112800000000003E-5,2.9227999999999999E-5,1.20275E-5,1.73895E-5,2.7131199999999999E-5,4.6315800000000001E-5,2.9547999999999999E-5,2.783E-5,1.9404099999999999E-5,2.783E-5,4.4397699999999997E-5,3.5500499999999997E-5,3.4244800000000001E-5,3.5642400000000003E-5,4.0993900000000001E-5,2.9269200000000001E-5,4.2886300000000003E-5,4.6554899999999997E-5,5.0368999999999998E-5,4.2803799999999998E-5,3.3554099999999998E-5,2.33415E-5,3.6383200000000001E-5,4.3049400000000002E-5]
[null,null,null,837,3.38736E-5,1.3482199999999999E-5,3.6023899999999999E-5,2.1725E-5,4.5325399999999998E-5,3.0499500000000002E-5,4.1606500000000002E-5,2.2575700000000001E-5,4.4594E-5,3.54555E-5,2.1217300000000001E-5,3.1361400000000001E-5,4.4817700000000003E-5,7.1078900000000003E-6,2.8589999999999999E-5,3.968E-5,2.7161600000000001E-5,1.8635100000000001E-5,1.49788E-5,2.9853899999999999E-5,1.6725600000000001E-5,2.0073099999999999E-5,1.92716E-5,3.7899299999999998E-5,4.4118900000000002E-5,4.2114199999999997E-5,3.02594E-5,3.0664299999999997E-5,2.7171200000000002E-5,3.2325900000000002E-5,2.03916E-5,3.1600799999999997E-5,2.8400800000000001E-5,1.5846699999999999E-5,2.34359E-5,4.4851800000000003E-5,1.95217E-5]
[null,null,null,838,1.95278E-5,1.30043E-5,6.1049099999999996E-6,1.4617700000000001E-5,2.8659200000000002E-5,2.6404799999999998E-5,1.58333E-5,8.2808599999999995E-6,2.55836E-5,2.9998700000000001E-5,2.0969299999999999E-5,2.6203E-5,2.5548300000000001E-5,1.04995E-5,1.30971E-5,4.1664700000000001E-5,1.3197899999999999E-5,1.50568E-5,2.60241E-5,6.1487500000000002E-6,1.16005E-5,3.0957299999999998E-6,1.17263E-6,2.3546399999999999E-5,1.9070999999999999E-6,2.4647700000000001E-5,2.6456800000000001E-5,2.2371800000000002E-5,1.5855500000000001E-5,1.8541599999999999E-5,7.17953E-6,2.1149699999999998E-5,1.7699399999999999E-5,1.2832200000000001E-5,-2.7870000000000002E-6,2.1285E-5,4.0533200000000004E-6]
[null,null,null,839,1.27298E-5,7.8759000000000003E-6,3.6587700000000002E-5,2.42252E-5,9.7043699999999994E-6,-5.0791299999999998E-6,1.85978E-5,1.1282599999999999E-5,1.5990499999999999E-5,1.26626E-5,2.7885599999999999E-5,-3.9070199999999997E-6,-2.6028299999999999E-6,-5.4972399999999999E-6,1.03357E-5,1.97675E-5,-5.1609E-6,-1.6690100000000001E-5,1.1606100000000001E-5,-2.9901E-6,3.2692599999999999E-5,4.1389800000000001E-5,-5.44198E-6,3.64382E-5,7.6942299999999999E-7,2.2835799999999999E-5,3.6339099999999999E-5,1.5561900000000001E-5,-3.8552099999999998E-6,1.5356600000000001E-5,2.1990599999999999E-5,4.7790600000000003E-5,1.8916800000000002E-5,8.1569800000000003E-6,3.6625599999999997E-5,2.4251099999999999E-5,7.1084200000000001E-6]
[null,null,null,840,-1.54688E-5,-2.6009299999999999E-6,-5.9633500000000003E-6,2.9413599999999999E-5,-2.0097000000000001E-5,-2.2860000000000001E-5,-1.1732299999999999E-5,1.05621E-5,-1.15548E-5,-3.8439799999999997E-5,-2.0190399999999999E-5,-8.8516599999999992E-6,-2.8832499999999999E-5,-2.5292599999999999E-5,-5.9170000000000003E-6,3.7417300000000001E-6,1.17783E-5,-4.7689100000000001E-6,-3.8644499999999999E-6,-2.7798800000000001E-6,-1.32424E-5,-4.11852E-5,-8.3088499999999992E-6,-2.7075799999999999E-5,7.5499499999999996E-6,-2.41544E-5,-4.4010300000000003E-6,-9.2324100000000006E-6,-1.9015E-5,-4.5604999999999998E-6,1.1033700000000001E-5,-1.1330199999999999E-6,-1.4449300000000001E-5,-1.77107E-5,-2.9399599999999999E-5,-1.54317E-5,-2.4649799999999999E-5]
[null,null,null,841,1.22694E-5,2.2628199999999999E-6,2.1836000000000002E-6,3.7663500000000003E-5,1.9398E-5,3.6363799999999999E-5,2.9719400000000001E-6,1.98201E-5,8.0876399999999997E-6,1.6341000000000002E-5,1.415E-5,1.26018E-5,1.02177E-5,1.49287E-5,3.0533500000000002E-5,1.5483000000000001E-5,2.89922E-5,1.4011299999999999E-5,7.7790800000000001E-6,2.59653E-5,7.8591900000000002E-6,3.5742599999999999E-5,1.5728900000000001E-5,4.7151599999999999E-6,1.5264199999999999E-5,9.2933999999999998E-6,8.9290200000000001E-6,2.0693500000000001E-5,2.5885200000000001E-5,3.4155900000000003E-5,2.2282100000000001E-5,3.1452699999999998E-5,3.1233499999999998E-5,9.0961200000000006E-6,6.6877200000000001E-6,3.5239099999999999E-5,2.07178E-5]
[null,null,null,842,5.4979999999999997E-6,1.1851000000000001E-5,-3.9271500000000002E-6,8.3954700000000008E-6,-1.06809E-5,1.1409200000000001E-5,3.8426000000000003E-6,-4.0000200000000004E-6,1.63791E-5,2.4963499999999998E-6,2.3329400000000001E-5,2.1228499999999999E-6,4.7256700000000003E-7,-7.9809799999999998E-7,-7.3849999999999996E-6,2.57577E-6,-3.7497899999999998E-6,7.8131499999999999E-6,-2.2930900000000001E-7,-7.5639200000000002E-6,2.9754599999999999E-6,-6.3591599999999998E-6,-5.9825300000000003E-7,-1.45926E-5,-4.2129599999999999E-6,2.0966599999999999E-7,-4.8893600000000003E-7,-4.1531799999999998E-6,5.8892899999999998E-6,1.94957E-5,1.04323E-5,6.9591199999999997E-6,-5.1208000000000002E-6,7.5881199999999999E-6,8.4431500000000006E-6,6.3958800000000003E-6,2.5476100000000002E-5]
[null,null,null,843,-3.1545499999999998E-5,-4.8065000000000001E-5,-2.4352300000000001E-5,-3.5692999999999999E-5,-5.2608000000000002E-5,-4.4146600000000002E-5,-6.2053100000000004E-5,-3.1052800000000002E-5,-2.5097400000000001E-5,-4.8956999999999999E-5,-4.45012E-5,-3.0032E-5,-3.56472E-5,-6.4487300000000002E-5,-5.97089E-5,-4.8195899999999997E-5,-6.8050400000000002E-5,-5.1719799999999999E-5,-4.14694E-5,-6.3697999999999999E-5,-4.1172299999999999E-5,-3.8426000000000001E-5,-5.1101199999999998E-5,-3.8265300000000001E-5,-5.7831499999999997E-5,-2.6066200000000001E-5,-5.1510500000000001E-5,-6.1845899999999997E-5,-4.8704E-5,-4.0238199999999997E-5,-3.02546E-5,-3.6358E-5,-5.2824000000000001E-5,-5.3302800000000001E-5,-3.9783100000000002E-5,-5.8214300000000003E-5,-3.3245599999999999E-5]
[null,null,null,844,-6.2818799999999996E-5,-4.0196900000000001E-5,-6.5702699999999997E-5,-3.2029500000000002E-5,-4.0191100000000002E-5,-6.2073099999999994E-5,-3.8398400000000002E-5,-3.4245400000000002E-5,-3.7552300000000003E-5,-5.5695600000000003E-5,-4.6146799999999997E-5,-5.3563300000000003E-5,-2.80017E-5,-4.9534899999999999E-5,-3.76716E-5,-2.6738500000000002E-5,-4.2329300000000001E-5,-3.3794699999999997E-5,-3.76716E-5,-4.3140799999999999E-5,-5.6990000000000002E-5,-4.0634599999999999E-5,-3.8813300000000003E-5,-2.0548899999999999E-5,-4.31166E-5,-4.0435600000000003E-5,-4.2300499999999999E-5,-4.4944000000000002E-5,-3.7190400000000002E-5,-3.32369E-5,-4.11294E-5,-4.5852300000000001E-5,-3.1302700000000001E-5,-4.5670800000000003E-5,-2.9865999999999998E-5,-9.6784799999999992E-6,-2.7732000000000001E-5]
[null,null,null,845,-4.5304300000000003E-6,-6.3427799999999999E-6,-2.3224999999999999E-5,1.7553299999999999E-7,1.6517399999999999E-5,-1.9938299999999998E-5,-2.7554100000000001E-5,-9.3814600000000005E-6,-2.3627299999999998E-6,-1.22517E-5,-7.9276000000000001E-6,-2.55961E-7,-9.9643399999999999E-6,-1.48154E-5,-1.3436599999999999E-5,-1.88001E-5,-1.59044E-5,-9.4940200000000006E-6,-7.81504E-6,-1.4513499999999999E-5,-7.0287200000000005E-7,-4.5924000000000003E-5,-8.59723E-6,-8.9486600000000001E-6,-2.6669299999999999E-5,-1.4639499999999999E-5,-7.5460700000000001E-6,-1.78732E-5,-1.6826699999999999E-5,-2.91701E-5,-2.4193799999999999E-6,-2.5410199999999999E-5,1.65912E-6,-3.1527099999999998E-5,-9.0870499999999997E-6,2.7197500000000001E-6,-6.69887E-6]
[null,null,null,846,-9.9630799999999998E-6,-1.7334300000000001E-5,-2.3607800000000001E-5,-1.6074900000000001E-5,1.367E-5,-7.0260899999999997E-6,-1.7356100000000001E-5,-2.1302999999999999E-5,-1.3304E-5,-8.0708599999999998E-6,-1.7912799999999999E-5,-1.69196E-5,-1.9573100000000001E-5,-2.8614000000000001E-5,-1.9049700000000002E-5,-1.5435500000000002E-5,-2.5278200000000001E-5,-1.10565E-5,-6.1546499999999996E-6,-7.3016499999999998E-6,-1.97754E-5,-9.9725699999999996E-6,-1.11971E-5,-7.5097299999999998E-6,-2.3828900000000002E-5,-1.6664399999999999E-5,-3.5967000000000003E-5,-2.5344999999999999E-5,-4.08978E-5,-3.9143300000000002E-5,-1.8086900000000001E-5,-2.3291000000000001E-5,-3.60273E-5,-2.9482600000000001E-5,-3.6997299999999999E-5,-1.36911E-5,-4.1104399999999999E-5]
[null,null,null,847,-6.96105E-6,-2.2479500000000001E-5,-3.5791199999999997E-5,-2.1936699999999999E-6,-1.7320999999999999E-5,-2.2505800000000001E-5,-8.8011900000000007E-6,-1.5865599999999999E-5,-6.8996199999999997E-6,-1.3440200000000001E-5,-2.9830899999999999E-5,-2.24501E-5,-2.22383E-5,-1.6942100000000002E-5,-1.07335E-5,-1.9673900000000001E-6,-2.0301599999999999E-5,-1.66694E-5,-1.9876699999999999E-5,-1.0594999999999999E-5,-4.7537200000000003E-5,-9.8424999999999994E-6,-2.4927500000000001E-5,-2.9218599999999998E-5,-4.0513599999999996E-6,-2.4655400000000002E-6,-1.5598199999999999E-5,-1.63249E-5,-1.6052399999999999E-5,-6.9141200000000001E-6,-1.8791600000000001E-5,-1.8411899999999999E-5,-4.2763E-6,4.3976099999999999E-7,-1.6778599999999999E-5,-2.88916E-5,-2.8373599999999999E-5]
[null,null,null,848,8.7685099999999998E-6,-2.6291800000000001E-5,-2.5938399999999999E-5,-3.6761499999999997E-5,-3.47543E-5,-3.7865399999999998E-5,-3.5855300000000002E-5,-2.5355999999999999E-5,-3.7677299999999999E-5,9.0218699999999998E-7,-2.38452E-5,-4.2615499999999999E-5,-4.3029199999999998E-5,-3.7820900000000002E-5,-3.06316E-5,-1.0137400000000001E-5,-3.4761700000000003E-5,-1.75147E-5,-3.7849399999999997E-5,-2.5225E-5,5.42082E-7,-2.00964E-5,-2.01568E-5,-2.2946400000000001E-5,-2.9286100000000001E-5,-1.5778899999999999E-5,-3.1363399999999999E-5,-2.3752900000000001E-5,1.25082E-5,5.2915299999999996E-6,-3.0874899999999998E-5,-7.4132399999999999E-6,-1.72629E-5,8.1643999999999993E-6,-1.68936E-5,-3.00121E-5,-4.1278500000000001E-5]
[null,null,null,849,-4.2109900000000001E-5,-4.9687100000000001E-5,-2.6792100000000001E-5,-3.8099899999999998E-5,-2.3465400000000001E-5,-4.15963E-5,-4.9765100000000002E-5,-3.3278899999999997E-5,-5.1450199999999997E-5,-5.51074E-5,-2.81515E-5,-4.1850200000000001E-5,-4.4775899999999999E-5,-4.1245000000000002E-5,-4.69176E-5,-2.1853900000000001E-5,-5.6209699999999998E-5,-4.3226000000000003E-5,-3.4855899999999999E-5,-4.3739699999999997E-5,-2.9439999999999999E-5,-3.6291699999999997E-5,-4.1315500000000001E-5,-4.0211499999999999E-5,-2.075E-5,-3.4490799999999998E-5,-1.38009E-5,-3.8505499999999999E-5,-2.5712200000000001E-5,-4.29434E-5,-2.09633E-5,-3.1888199999999997E-5,-2.9926499999999999E-5,-3.5573800000000002E-5,-1.4810199999999999E-5,-3.64569E-5,-3.6318600000000002E-5]
[null,null,null,850,2.5259999999999999E-5,4.5979399999999999E-6,3.4694499999999998E-5,2.1013699999999998E-5,3.0558000000000001E-5,2.2910099999999999E-5,1.6990099999999998E-5,7.5603500000000004E-6,1.8705100000000002E-5,1.6072100000000002E-5,7.2660399999999998E-6,3.6719700000000002E-6,-3.0992299999999999E-6,-7.1275900000000003E-6,5.7116100000000004E-6,1.9952499999999999E-5,1.1254600000000001E-5,4.30364E-6,4.7761099999999997E-6,-5.6559000000000003E-6,1.3435799999999999E-5,4.43884E-6,1.25067E-5,1.75469E-5,2.1806000000000001E-5,2.4844699999999999E-5,1.56728E-5,8.4958499999999993E-6,2.79599E-5,4.1273299999999997E-5,1.6449200000000002E-5,1.7278100000000001E-6,2.3476500000000001E-5,1.8900699999999999E-6,2.8542300000000001E-6,2.2243500000000001E-5,1.50586E-5]
[]
[null,null,null,"Wavelength","Relative spectral radiant flux"]
[null,null,null,"nm","a.u. / nm"]
[null,null,null,380,-1.6567100000000001E-2]
[null,null,null,381,-0.122682]
[null,null,null,382,-8.3724699999999999E-2]
[null,null,null,383,-3.3712699999999998E-2]
[null,null,null,384,6.6441399999999998E-2]
[null,null,null,385,-9.7700500000000006E-3]
[null,null,null,386,-2.64742E-2]
[null,null,null,387,3.2191900000000002E-2]
[null,null,null,388,2.6931299999999998E-2]
[null,null,null,389,2.3354799999999998E-2]
[null,null,null,390,-1.1149900000000001E-2]
[null,null,null,391,-3.1750899999999999E-2]
[null,null,null,392,1.39212E-2]
[null,null,null,393,-2.7970200000000001E-2]
[null,null,null,394,9.5867899999999995E-3]
[null,null,null,395,1.54623E-2]
[null,null,null,396,4.9940000000000002E-3]
[null,null,null,397,-3.3035199999999999E-3]
[null,null,null,398,1.94649E-2]
[null,null,null,399,-2.4654199999999999E-4]
[null,null,null,400,1.8093600000000001E-2]
[null,null,null,401,1.9603899999999998E-3]
[null,null,null,402,-3.6751399999999999E-3]
[null,null,null,403,3.0399800000000001E-2]
[null,null,null,404,2.5429400000000001E-2]
[null,null,null,405,4.9042599999999999E-2]
[null,null,null,406,-4.0256199999999999E-2]
[null,null,null,407,8.3509399999999994E-3]
[null,null,null,408,1.27032E-2]
[null,null,null,409,2.1498699999999999E-2]
[null,null,null,410,-1.5930799999999998E-2]
[null,null,null,411,1.4545500000000001E-4]
[null,null,null,412,-2.63416E-2]
[null,null,null,413,1.0842900000000001E-2]
[null,null,null,414,1.6828699999999999E-2]
[null,null,null,415,2.2941200000000002E-3]
[null,null,null,416,-1.0599900000000001E-2]
[null,null,null,417,4.3033599999999998E-2]
[null,null,null,418,4.5260400000000003E-3]
[null,null,null,419,-3.7014299999999999E-3]
[null,null,null,420,1.75558E-2]
[null,null,null,421,1.7266E-2]
[null,null,null,422,3.7634300000000002E-2]
[null,null,null,423,8.5268900000000005E-3]
[null,null,null,424,1.7039800000000001E-2]
[null,null,null,425,2.23859E-2]
[null,null,null,426,1.94719E-2]
[null,null,null,427,3.2766400000000001E-2]
[null,null,null,428,-3.3479600000000001E-3]
[null,null,null,429,1.92915E-2]
[null,null,null,430,1.6595E-3]
[null,null,null,431,2.4701300000000001E-3]
[null,null,null,432,-1.4904799999999999E-2]
[null,null,null,433,-7.7703700000000004E-3]
[null,null,null,434,2.3009900000000002E-3]
[null,null,null,435,4.0415199999999998E-2]
[null,null,null,436,1.18484E-2]
[null,null,null,437,2.1461999999999998E-2]
[null,null,null,438,4.0925099999999999E-2]
[null,null,null,439,3.63215E-2]
[null,null,null,440,4.6819199999999998E-2]
[null,null,null,441,3.9882099999999997E-2]
[null,null,null,442,3.0509399999999999E-2]
[null,null,null,443,6.9292900000000004E-2]
[null,null,null,444,3.08591E-2]
[null,null,null,445,6.2891500000000003E-2]
[null,null,null,446,7.62771E-2]
[null,null,null,447,7.5882000000000005E-2]
[null,null,null,448,9.6038700000000005E-2]
[null,null,null,449,0.107136]
[null,null,null,450,0.121681]
[null,null,null,451,0.13675300000000001]
[null,null,null,452,0.15901899999999999]
[null,null,null,453,0.19187199999999999]
[null,null,null,454,0.19509299999999999]
[null,null,null,455,0.20250899999999999]
[null,null,null,456,0.221002]
[null,null,null,457,0.25910899999999998]
[null,null,null,458,0.25929200000000002]
[null,null,null,459,0.29888500000000001]
[null,null,null,460,0.30394599999999999]
[null,null,null,461,0.29866700000000002]
[null,null,null,462,0.321795]
[null,null,null,463,0.33284999999999998]
[null,null,null,464,0.33419300000000002]
[null,null,null,465,0.33235999999999999]
[null,null,null,466,0.30946800000000002]
[null,null,null,467,0.33591700000000002]
[null,null,null,468,0.33922799999999997]
[null,null,null,469,0.32648199999999999]
[null,null,null,470,0.31236799999999998]
[null,null,null,471,0.28843800000000003]
[null,null,null,472,0.31479299999999999]
[null,null,null,473,0.30585299999999999]
[null,null,null,474,0.28859400000000002]
[null,null,null,475,0.29453499999999999]
[null,null,null,476,0.31811]
[null,null,null,477,0.31170199999999998]
[null,null,null,478,0.30599999999999999]
[null,null,null,479,0.31786700000000001]
[null,null,null,480,0.30223800000000001]
[null,null,null,481,0.26821]
[null,null,null,482,0.26777699999999999]
[null,null,null,483,0.27229300000000001]
[null,null,null,484,0.27289000000000002]
[null,null,null,485,0.28016799999999997]
[null,null,null,486,0.26486300000000002]
[null,null,null,487,0.28128500000000001]
[null,null,null,488,0.240455]
[null,null,null,489,0.26819999999999999]
[null,null,null,490,0.25994299999999998]
[null,null,null,491,0.28565600000000002]
[null,null,null,492,0.27227299999999999]
[null,null,null,493,0.27249299999999999]
[null,null,null,494,0.27116899999999999]
[null,null,null,495,0.25584600000000002]
[null,null,null,496,0.242289]
[null,null,null,497,0.257521]
[null,null,null,498,0.26278800000000002]
[null,null,null,499,0.264903]
[null,null,null,500,0.26470300000000002]
[null,null,null,501,0.264658]
[null,null,null,502,0.28222599999999998]
[null,null,null,503,0.27293899999999999]
[null,null,null,504,0.28595100000000001]
[null,null,null,505,0.28082099999999999]
[null,null,null,506,0.28999599999999998]
[null,null,null,507,0.30507400000000001]
[null,null,null,508,0.32352999999999998]
[null,null,null,509,0.31384600000000001]
[null,null,null,510,0.30419499999999999]
[null,null,null,511,0.33380199999999999]
[null,null,null,512,0.32796500000000001]
[null,null,null,513,0.31978600000000001]
[null,null,null,514,0.321712]
[null,null,null,515,0.32813700000000001]
[null,null,null,516,0.34526099999999998]
[null,null,null,517,0.35215099999999999]
[null,null,null,518,0.33171099999999998]
[null,null,null,519,0.33806999999999998]
[null,null,null,520,0.34345399999999998]
[null,null,null,521,0.34676800000000002]
[null,null,null,522,0.37992300000000001]
[null,null,null,523,0.35878100000000002]
[null,null,null,524,0.37043999999999999]
[null,null,null,525,0.36458699999999999]
[null,null,null,526,0.37024499999999999]
[null,null,null,527,0.38660899999999998]
[null,null,null,528,0.40043899999999999]
[null,null,null,529,0.378971]
[null,null,null,530,0.37498700000000001]
[null,null,null,531,0.40051900000000001]
[null,null,null,532,0.40669]
[null,null,null,533,0.41638700000000001]
[null,null,null,534,0.40401500000000001]
[null,null,null,535,0.40834500000000001]
[null,null,null,536,0.435612]
[null,null,null,537,0.436419]
[null,null,null,538,0.42687900000000001]
[null,null,null,539,0.41833999999999999]
[null,null,null,540,0.43171500000000002]
[null,null,null,541,0.42181999999999997]
[null,null,null,542,0.442384]
[null,null,null,543,0.44181199999999998]
[null,null,null,544,0.46451399999999998]
[null,null,null,545,0.45971600000000001]
[null,null,null,546,0.466055]
[null,null,null,547,0.47497899999999998]
[null,null,null,548,0.488147]
[null,null,null,549,0.50595299999999999]
[null,null,null,550,0.49484600000000001]
[null,null,null,551,0.498446]
[null,null,null,552,0.495863]
[null,null,null,553,0.526864]
[null,null,null,554,0.53608900000000004]
[null,null,null,555,0.54894799999999999]
[null,null,null,556,0.55605599999999999]
[null,null,null,557,0.55144599999999999]
[null,null,null,558,0.58447499999999997]
[null,null,null,559,0.57747400000000004]
[null,null,null,560,0.58513199999999999]
[null,null,null,561,0.61316400000000004]
[null,null,null,562,0.61293799999999998]
[null,null,null,563,0.61261399999999999]
[null,null,null,564,0.63954599999999995]
[null,null,null,565,0.64777899999999999]
[null,null,null,566,0.649864]
[null,null,null,567,0.64773199999999997]
[null,null,null,568,0.68540500000000004]
[null,null,null,569,0.70006000000000002]
[null,null,null,570,0.68918800000000002]
[null,null,null,571,0.71909000000000001]
[null,null,null,572,0.71745499999999995]
[null,null,null,573,0.736931]
[null,null,null,574,0.74841299999999999]
[null,null,null,575,0.76532999999999995]
[null,null,null,576,0.77329899999999996]
[null,null,null,577,0.77851599999999999]
[null,null,null,578,0.79047199999999995]
[null,null,null,579,0.81734099999999998]
[null,null,null,580,0.834561]
[null,null,null,581,0.84303899999999998]
[null,null,null,582,0.87348300000000001]
[null,null,null,583,0.874529]
[null,null,null,584,0.87148999999999999]
[null,null,null,585,0.88078100000000004]
[null,null,null,586,0.89041899999999996]
[null,null,null,587,0.90293800000000002]
[null,null,null,588,0.93300499999999997]
[null,null,null,589,0.92544300000000002]
[null,null,null,590,0.938087]
[null,null,null,591,0.94635000000000002]
[null,null,null,592,0.952824]
[null,null,null,593,0.95751500000000001]
[null,null,null,594,0.96547400000000005]
[null,null,null,595,0.96091700000000002]
[null,null,null,596,0.97739900000000002]
[null,null,null,597,0.99475899999999995]
[null,null,null,598,0.98574700000000004]
[null,null,null,599,0.98224900000000004]
[null,null,null,600,0.98952700000000005]
[null,null,null,601,1]
[null,null,null,602,0.99367099999999997]
[null,null,null,603,0.97948500000000005]
[null,null,null,604,0.97365299999999999]
[null,null,null,605,0.98931999999999998]
[null,null,null,606,0.99666600000000005]
[null,null,null,607,0.99564900000000001]
[null,null,null,608,0.99789799999999995]
[null,null,null,609,0.98158599999999996]
[null,null,null,610,0.97721400000000003]
[null,null,null,611,0.98846699999999998]
[null,null,null,612,0.973001]
[null,null,null,613,0.96184700000000001]
[null,null,null,614,0.94628800000000002]
[null,null,null,615,0.94264300000000001]
[null,null,null,616,0.95047400000000004]
[null,null,null,617,0.930087]
[null,null,null,618,0.96774300000000002]
[null,null,null,619,0.91004099999999999]
[null,null,null,620,0.91632199999999997]
[null,null,null,621,0.915211]
[null,null,null,622,0.904617]
[null,null,null,623,0.89784900000000001]
[null,null,null,624,0.88061999999999996]
[null,null,null,625,0.86268999999999996]
[null,null,null,626,0.86024400000000001]
[null,null,null,627,0.84906899999999996]
[null,null,null,628,0.83788300000000004]
[null,null,null,629,0.83198399999999995]
[null,null,null,630,0.81429700000000005]
[null,null,null,631,0.78871000000000002]
[null,null,null,632,0.75749100000000003]
[null,null,null,633,0.77965700000000004]
[null,null,null,634,0.76870400000000005]
[null,null,null,635,0.75815900000000003]
[null,null,null,636,0.72834200000000004]
[null,null,null,637,0.70976899999999998]
[null,null,null,638,0.745112]
[null,null,null,639,0.70371600000000001]
[null,null,null,640,0.69828100000000004]
[null,null,null,641,0.68045199999999995]
[null,null,null,642,0.66778499999999996]
[null,null,null,643,0.65152500000000002]
[null,null,null,644,0.64412100000000005]
[null,null,null,645,0.63008900000000001]
[null,null,null,646,0.59199500000000005]
[null,null,null,647,0.57504900000000003]
[null,null,null,648,0.58976200000000001]
[null,null,null,649,0.54721500000000001]
[null,null,null,650,0.56002700000000005]
[null,null,null,651,0.54360900000000001]
[null,null,null,652,0.53919799999999996]
[null,null,null,653,0.52300000000000002]
[null,null,null,654,0.50834000000000001]
[null,null,null,655,0.49895600000000001]
[null,null,null,656,0.47615800000000003]
[null,null,null,657,0.46998800000000002]
[null,null,null,658,0.46101199999999998]
[null,null,null,659,0.45928600000000003]
[null,null,null,660,0.42647299999999999]
[null,null,null,661,0.45679999999999998]
[null,null,null,662,0.41225000000000001]
[null,null,null,663,0.413827]
[null,null,null,664,0.39180700000000002]
[null,null,null,665,0.39493899999999998]
[null,null,null,666,0.39121600000000001]
[null,null,null,667,0.37238500000000002]
[null,null,null,668,0.36016799999999999]
[null,null,null,669,0.341584]
[null,null,null,670,0.33545599999999998]
[null,null,null,671,0.33064399999999999]
[null,null,null,672,0.31719399999999998]
[null,null,null,673,0.329322]
[null,null,null,674,0.311444]
[null,null,null,675,0.28864099999999998]
[null,null,null,676,0.27996100000000002]
[null,null,null,677,0.29163499999999998]
[null,null,null,678,0.26454299999999997]
[null,null,null,679,0.26048100000000002]
[null,null,null,680,0.261569]
[null,null,null,681,0.24967300000000001]
[null,null,null,682,0.243147]
[null,null,null,683,0.25364300000000001]
[null,null,null,684,0.24795]
[null,null,null,685,0.214451]
[null,null,null,686,0.22913700000000001]
[null,null,null,687,0.21329899999999999]
[null,null,null,688,0.21363499999999999]
[null,null,null,689,0.19885900000000001]
[null,null,null,690,0.18812899999999999]
[null,null,null,691,0.17072499999999999]
[null,null,null,692,0.17236599999999999]
[null,null,null,693,0.16358800000000001]
[null,null,null,694,0.18424499999999999]
[null,null,null,695,0.17302200000000001]
[null,null,null,696,0.173207]
[null,null,null,697,0.167019]
[null,null,null,698,0.15729899999999999]
[null,null,null,699,0.149953]
[null,null,null,700,0.15489900000000001]
[null,null,null,701,0.160028]
[null,null,null,702,0.12953799999999999]
[null,null,null,703,0.120297]
[null,null,null,704,0.12039800000000001]
[null,null,null,705,0.12435499999999999]
[null,null,null,706,0.121375]
[null,null,null,707,0.10503700000000001]
[null,null,null,708,0.110887]
[null,null,null,709,0.102494]
[null,null,null,710,9.7034800000000004E-2]
[null,null,null,711,0.116887]
[null,null,null,712,0.103668]
[null,null,null,713,7.5291899999999995E-2]
[null,null,null,714,9.3551099999999998E-2]
[null,null,null,715,0.102438]
[null,null,null,716,8.1149700000000005E-2]
[null,null,null,717,7.9784499999999994E-2]
[null,null,null,718,8.0198500000000006E-2]
[null,null,null,719,8.7294899999999995E-2]
[null,null,null,720,7.7728800000000001E-2]
[null,null,null,721,6.8308499999999994E-2]
[null,null,null,722,8.5735199999999998E-2]
[null,null,null,723,7.6829599999999998E-2]
[null,null,null,724,8.3070099999999994E-2]
[null,null,null,725,5.6647000000000003E-2]
[null,null,null,726,7.0660299999999995E-2]
[null,null,null,727,7.2474399999999994E-2]
[null,null,null,728,6.2025299999999998E-2]
[null,null,null,729,4.5944499999999999E-2]
[null,null,null,730,4.3553799999999997E-2]
[null,null,null,731,6.0877899999999999E-2]
[null,null,null,732,5.3693900000000003E-2]
[null,null,null,733,5.3449799999999999E-2]
[null,null,null,734,6.9141599999999998E-2]
[null,null,null,735,4.2079999999999999E-2]
[null,null,null,736,4.5973899999999998E-2]
[null,null,null,737,3.5723100000000001E-2]
[null,null,null,738,5.49988E-2]
[null,null,null,739,5.2539500000000003E-2]
[null,null,null,740,2.7617800000000001E-2]
[null,null,null,741,4.1361099999999998E-2]
[null,null,null,742,4.63335E-2]
[null,null,null,743,4.06684E-2]
[null,null,null,744,5.03329E-2]
[null,null,null,745,4.3981300000000001E-2]
[null,null,null,746,4.8293799999999998E-2]
[null,null,null,747,2.0624E-2]
[null,null,null,748,2.0451500000000001E-2]
[null,null,null,749,3.3679800000000003E-2]
[null,null,null,750,3.4379E-2]
[null,null,null,751,3.4578200000000003E-2]
[null,null,null,752,2.51527E-2]
[null,null,null,753,1.4013100000000001E-2]
[null,null,null,754,4.0507000000000001E-2]
[null,null,null,755,2.7747600000000001E-2]
[null,null,null,756,3.5134600000000002E-2]
[null,null,null,757,4.4086100000000003E-2]
[null,null,null,758,2.08127E-2]
[null,null,null,759,2.5790199999999999E-2]
[null,null,null,760,4.0124800000000002E-2]
[null,null,null,761,2.6134299999999999E-2]
[null,null,null,762,1.11138E-2]
[null,null,null,763,2.5805100000000001E-2]
[null,null,null,764,1.6770199999999999E-2]
[null,null,null,765,2.25413E-2]
[null,null,null,766,-9.8813800000000004E-3]
[null,null,null,767,1.56229E-2]
[null,null,null,768,2.3765600000000001E-2]
[null,null,null,769,2.36186E-2]
[null,null,null,770,9.9321600000000006E-3]
[null,null,null,771,3.4553100000000003E-2]
[null,null,null,772,1.2197899999999999E-2]
[null,null,null,773,2.6525099999999999E-2]
[null,null,null,774,1.8519600000000001E-2]
[null,null,null,775,3.0019000000000001E-2]
[null,null,null,776,4.9880300000000001E-3]
[null,null,null,777,5.29081E-3]
[null,null,null,778,1.20254E-2]
[null,null,null,779,1.4375499999999999E-2]
[null,null,null,780,3.3827999999999997E-2]
[null,null,null,781,1.33741E-2]
[null,null,null,782,8.7372600000000002E-3]
[null,null,null,783,5.4280099999999996E-3]
[null,null,null,784,-1.1297200000000001E-3]
[null,null,null,785,3.1611899999999998E-2]
[null,null,null,786,2.0058800000000002E-2]
[null,null,null,787,2.1311400000000001E-2]
[null,null,null,788,-5.4346899999999998E-3]
[null,null,null,789,1.6312799999999999E-2]
[null,null,null,790,6.1554800000000005E-4]
[null,null,null,791,9.7324600000000001E-3]
[null,null,null,792,-3.4477700000000002E-3]
[null,null,null,793,1.36463E-2]
[null,null,null,794,1.49412E-2]
[null,null,null,795,-8.4567300000000002E-4]
[null,null,null,796,1.9566599999999998E-3]
[null,null,null,797,-1.1712999999999999E-2]
[null,null,null,798,-1.3779700000000001E-2]
[null,null,null,799,1.6412E-2]
[null,null,null,800,2.57106E-2]
[null,null,null,801,-4.5003100000000004E-3]
[null,null,null,802,-3.5122600000000001E-3]
[null,null,null,803,1.06026E-2]
[null,null,null,804,4.9395300000000001E-3]
[null,null,null,805,3.6447699999999999E-3]
[null,null,null,806,2.4035500000000001E-2]
[null,null,null,807,8.6360900000000008E-3]
[null,null,null,808,1.1564100000000001E-2]
[null,null,null,809,2.45057E-3]
[null,null,null,810,-2.1288499999999998E-3]
[null,null,null,811,-7.0081800000000001E-3]
[null,null,null,812,-1.64932E-2]
[null,null,null,813,-1.00845E-2]
[null,null,null,814,-3.17775E-3]
[null,null,null,815,7.1558899999999998E-3]
[null,null,null,816,2.2963399999999998E-2]
[null,null,null,817,2.2537899999999999E-3]
[null,null,null,818,1.5975099999999999E-2]
[null,null,null,819,2.00562E-2]
[null,null,null,820,1.5662700000000002E-2]
[null,null,null,821,-6.85645E-3]
[null,null,null,822,-1.4013599999999999E-3]
[null,null,null,823,3.1523000000000002E-2]
[null,null,null,824,-7.3254599999999998E-3]
[null,null,null,825,1.1302599999999999E-2]
[null,null,null,826,-4.9141100000000002E-3]
[null,null,null,827,6.0024900000000001E-3]
[null,null,null,828,9.5019799999999997E-4]
[null,null,null,829,1.33223E-2]
[null,null,null,830,3.25976E-3]
[null,null,null,831,4.2408000000000001E-2]
[null,null,null,832,1.38668E-2]
[null,null,null,833,1.05308E-2]
[null,null,null,834,5.1862000000000002E-3]
[null,null,null,835,2.7705E-2]
[null,null,null,836,1.8619E-2]
[null,null,null,837,1.59113E-2]
[null,null,null,838,8.6804699999999992E-3]
[null,null,null,839,8.3212800000000003E-3]
[null,null,null,840,-5.93372E-3]
[null,null,null,841,1.0376399999999999E-2]
[null,null,null,842,1.43301E-3]
[null,null,null,843,-2.6168299999999999E-2]
[null,null,null,844,-2.2795099999999999E-2]
[null,null,null,845,-6.8274800000000004E-3]
[null,null,null,846,-1.05755E-2]
[null,null,null,847,-9.8485199999999995E-3]
[null,null,null,848,-1.3105199999999999E-2]
[null,null,null,849,-2.0708299999999999E-2]
[null,null,null,850,7.54698E-3]

{"sheet":"Config","index":3,"n_rows":54,"n_cols":6,"rows_kept":54,"cut":false,"hidden":false,"merged":[]}
["Do not edit!"]
[]
[]
[]
[]
["Table of possible names of nodes (Languages, version depending naming)"]
[]
["Tree level","Node Description","Names"]
[1,"Basic driver information","Driver information","Treiberinformationen"]
[1,"Device specific parameters","Device specific parameters","Gerätespezifische Parameter"]
[2,"Device information","Device information","Geräteinformationen"]
[3,"Manufacturer","Manufacturer","Hersteller"]
[3,"Device type","Device type","Gerätetyp"]
[3,"Serial number","Serial number","Seriennummer"]
[1,"General information about measurement","General information about measurement","Angaben zur Gesamtmessung"]
[2,"Spectral range","Spectral range","Spektralbereich"]
[3,"Start wavelength","Start wavelength","Startwellenlänge"]
[3,"End wavelength","End wavelength","Endwellenlänge"]
[3,"Resolution","Resolution","Auflösung"]
[2,"Measurement results of the integral measurement","Measurement values","Messwerte","results"]
[3,"Flag of conformity to LM-79-08 (color characteristics)","Conformity to LM-79-08 (color characteristics)","Konformität nach LM-79-08 (Farbcharakteristika)","LM-79-08 Konformität","LM-79-08 conformity"]
[3,"List of calculated integral colorimetric values","Mean color characteristics","Farbmaßzahlen Mittelwerte","Farbmaßzahlen, integral","Color characteristics, integral"]
[4,"Chromaticity x","Chromaticity x","Farbwertanteil x"]
[4,"Chromaticity y","Chromaticity y","Farbwertanteil y"]
[4,"Chromaticity u'","Chromaticity u'","Farbwertanteil u'"]
[4,"Chromaticity v'","Chromaticity v'","Farbwertanteil v'"]
[4,"Dom. wavelength [nm]","Dom. wavelength [nm]","Dom. Wellenlänge [nm]"]
[4,"Color purity [%]","Color purity [%]","Farbsättigung [%]"]
[4,"Corr. color temp. [K]","Corr. color temp. [K]","Farbtemperatur [K]","CCT [K]"]
[4,"chromaticity distance Duv / DC (delta uv)","Non-uniformity of chromaticity Du'v'","Farbungleichmäßigkeit Du'v'","max. Delta u'v'","Max. Delta u'v'"]
[4,"CRI general","CRI general","CRI allgemein"]
[4,"CRI, test chart 1 ","CRI, TCS 1","CRI, Testfarbe  1","CRI, Testfarbe 1","CRI, TCS1"]
[4,"CRI, test chart 2","CRI, TCS 2","CRI, Testfarbe  2","CRI, Testfarbe 2","CRI, TCS2"]
[4,"CRI, test chart 3","CRI, TCS 3","CRI, Testfarbe  3","CRI, Testfarbe 3","CRI, TCS3"]
[4,"CRI, test chart 4","CRI, TCS 4","CRI, Testfarbe  4","CRI, Testfarbe 4","CRI, TCS4"]
[4,"CRI, test chart 5","CRI, TCS 5","CRI, Testfarbe  5","CRI, Testfarbe 5","CRI, TCS5"]
[4,"CRI, test chart 6","CRI, TCS 6","CRI, Testfarbe  6","CRI, Testfarbe 6","CRI, TCS6"]
[4,"CRI, test chart 7","CRI, TCS 7","CRI, Testfarbe  7","CRI, Testfarbe 7","CRI, TCS7"]
[4,"CRI, test chart 8","CRI, TCS 8","CRI, Testfarbe  8","CRI, Testfarbe 8","CRI, TCS8"]
[4,"CRI, test chart 9","CRI, TCS 9","CRI, Testfarbe  9","CRI, Testfarbe 9","CRI, TCS9"]
[4,"CRI, test chart 10","CRI, TCS10","CRI, Testfarbe 10"]
[4,"CRI, test chart 11","CRI, TCS11","CRI, Testfarbe 11"]
[4,"CRI, test chart 12","CRI, TCS12","CRI, Testfarbe 12"]
[4,"CRI, test chart 13","CRI, TCS13","CRI, Testfarbe 13"]
[4,"CRI, test chart 14","CRI, TCS14","CRI, Testfarbe 14"]
[4,"CRI, test chart 15","CRI, TCS15","CRI, Testfarbe 15"]
[1,"Root node for all results of single measurements","Single measurements","Einzelmessungen"]
[2,"Block with additional information for each single measuement","Additional information","Zusatzinformationen"]
[3,"Color characteristics","Color characteristics","Farbmaßzahlen"]
[4,"Chromaticity x","Chromaticity x","Farbwertanteil x"]
[4,"Chromaticity y","Chromaticity y","Farbwertanteil y"]
[4,"Illuminances","Illuminance [lx]","Beleuchtungsstärke [lx]"]
[2,"Node with list of measure results (SPD)","Measurement","Messung"]
[4,"Column title of wavelenghts","Wavelength","Wellenlänge"]

{"sheet":"Translate","index":4,"n_rows":62,"n_cols":4,"rows_kept":62,"cut":false,"hidden":false,"merged":[]}
["Translation of terms on the pages \"Start\" and \"Report\". Only edit content in cells marked with light green backgroud! If necessary contact TechnoTeam for the setup of additional languages."]
[]
[]
["Available languages","Deutsch"]
[null,"English"]
[null,"[new language]"]
[]
[]
[]
[null,{"$f":"B4","v":"Deutsch"},{"$f":"B5","v":"English"},{"$f":"B6","v":"[new language]"}]
[{"$f":"INDEX(B$11:J$227, ROW()-ROW(B$10), Start!$C$2)","v":"Load file"},"Messdatei laden …","Load file","Load file"]
[{"$f":"INDEX(B$11:J$227, ROW()-ROW(B$10), Start!$C$2)","v":"Generate report"},"Report generieren","Generate report","Generate report"]
[{"$f":"INDEX(B$11:J$227, ROW()-ROW(B$10), Start!$C$2)","v":"Protocol details"},"Angaben zum Protokoll","Protocol details","Protocol details"]
[{"$f":"INDEX(B$11:J$227, ROW()-ROW(B$10), Start!$C$2)","v":"Protocol no."},"Protokollnummer","Protocol no.","Protocol no."]
[{"$f":"INDEX(B$11:J$227, ROW()-ROW(B$10), Start!$C$2)","v":"Measuring system"},"Angaben zum Messsystem","Measuring system","Measuring system"]
[{"$f":"INDEX(B$11:J$227, ROW()-ROW(B$10), Start!$C$2)","v":"Type"},"Typ","Type","Type"]
[{"$f":"INDEX(B$11:J$227, ROW()-ROW(B$10), Start!$C$2)","v":"Manufacturer"},"Hersteller","Manufacturer","Manufacturer"]
[{"$f":"INDEX(B$11:J$227, ROW()-ROW(B$10), Start!$C$2)","v":"Spectroradiometer"},"Spektroradiometer","Spectroradiometer","Spectroradiometer"]
[{"$f":"INDEX(B$11:J$227, ROW()-ROW(B$10), Start!$C$2)","v":"Details of DUT"},"Angaben zum Messobjekt","Details of DUT","Details of DUT"]
[{"$f":"INDEX(B$11:J$227, ROW()-ROW(B$10), Start!$C$2)","v":"Product"},"Produkt","Product","Product"]
[{"$f":"INDEX(B$11:J$227, ROW()-ROW(B$10), Start!$C$2)","v":"Manufacturer"},"Hersteller","Manufacturer","Manufacturer"]
[{"$f":"INDEX(B$11:J$227, ROW()-ROW(B$10), Start!$C$2)","v":"S/N"},"Seriennummer","S/N","S/N"]
[{"$f":"INDEX(B$11:J$227, ROW()-ROW(B$10), Start!$C$2)","v":"Description"},"Beschreibung","Description","Description"]
[{"$f":"INDEX(B$11:J$227, ROW()-ROW(B$10), Start!$C$2)","v":"Measurement details"},"Angaben zur Messung","Measurement details","Measurement details"]
[{"$f":"INDEX(B$11:J$227, ROW()-ROW(B$10), Start!$C$2)","v":"Measurement date"},"Messdatum","Measurement date","Measurement date"]
[{"$f":"INDEX(B$11:J$227, ROW()-ROW(B$10), Start!$C$2)","v":"Ambient temperature [°C]"},"Umgebungstemperatur [°C]","Ambient temperature [°C]","Ambient temperature [°C]"]
[{"$f":"INDEX(B$11:J$227, ROW()-ROW(B$10), Start!$C$2)","v":"Voltage [V]"},"Spannung [V]","Voltage [V]","Voltage [V]"]
[{"$f":"INDEX(B$11:J$227, ROW()-ROW(B$10), Start!$C$2)","v":"Current [A]"},"Strom [A]","Current [A]","Current [A]"]
[{"$f":"INDEX(B$11:J$227, ROW()-ROW(B$10), Start!$C$2)","v":"Active power [W]"},"Wirkleistung [W]","Active power [W]","Active power [W]"]
[{"$f":"INDEX(B$11:J$227, ROW()-ROW(B$10), Start!$C$2)","v":"Power factor"},"Leistungsfaktor","Power factor","Power factor"]
[{"$f":"INDEX(B$11:J$227, ROW()-ROW(B$10), Start!$C$2)","v":"Report settings"},"Reporteinstellungen","Report settings","Report settings"]
[{"$f":"INDEX(B$11:J$227, ROW()-ROW(B$10), Start!$C$2)","v":"Limit wavelength range [nm]"},"Wellenlängenbereich begrenzen auf [nm]","Limit wavelength range [nm]","Limit wavelength range [nm]"]
[{"$f":"INDEX(B$11:J$227, ROW()-ROW(B$10), Start!$C$2)","v":"Color diagram"},"Farbdiagramm","Color diagram","Color diagram"]
[{"$f":"INDEX(B$11:J$227, ROW()-ROW(B$10), Start!$C$2)","v":"Color - mean color coordinate"},"Farbe - mittlere Farbkoordinate","Color - mean color coordinate","Color - mean color coordinate"]
[{"$f":"INDEX(B$11:J$227, ROW()-ROW(B$10), Start!$C$2)","v":"Show color coordinates list"},"Farbkoordinatenliste anzeigen","Show color coordinates list","Show color coordinates list"]
[{"$f":"INDEX(B$11:J$227, ROW()-ROW(B$10), Start!$C$2)","v":"Color - color coordinates list"},"Farbe - Farbkoordinatenliste","Color - color coordinates list","Color - color coordinates list"]
[{"$f":"INDEX(B$11:J$227, ROW()-ROW(B$10), Start!$C$2)","v":"Threshold for displayed color coordinates (% of maximum illuminance)"},"Schwelle für angezeigte Farbkoordinaten (% von max. Beleuchtungsstärke)","Threshold for displayed color coordinates (% of maximum illuminance)","Threshold for displayed color coordinates (% of maximum illuminance)"]
[{"$f":"INDEX(B$11:J$227, ROW()-ROW(B$10), Start!$C$2)","v":"Measurement results"},"Messergebnisse","Measurement results","Measurement results"]
[{"$f":"INDEX(B$11:J$227, ROW()-ROW(B$10), Start!$C$2)","v":"Luminous flux [lm]"},"Lichtstrom [lm]","Luminous flux [lm]","Luminous flux [lm]"]
[]
[]
[{"$f":"INDEX(B$11:J$227, ROW()-ROW(B$10), Start!$C$2)","v":"Measurement protocol - goniospectrometric measurement"},"Messprotokoll - Goniospektrometrische Messung","Measurement protocol - goniospectrometric measurement","Measurement protocol - goniospectrometric measurement"]
[{"$f":"INDEX(B$11:J$227, ROW()-ROW(B$10), Start!$C$2)","v":"Protocol"},"Protokoll","Protocol","Protocol"]
[{"$f":"INDEX(B$11:J$227, ROW()-ROW(B$10), Start!$C$2)","v":"Date"},"Datum","Date","Date"]
[{"$f":"INDEX(B$11:J$227, ROW()-ROW(B$10), Start!$C$2)","v":"Page"},"Seite","Page","Page"]
[{"$f":"INDEX(B$11:J$227, ROW()-ROW(B$10), Start!$C$2)","v":"DUT"},"Messobjekt","DUT","DUT"]
[{"$f":"INDEX(B$11:J$227, ROW()-ROW(B$10), Start!$C$2)","v":"Measuring system"},"Messsystem","Measuring system","Measuring system"]
[{"$f":"INDEX(B$11:J$227, ROW()-ROW(B$10), Start!$C$2)","v":"Information on the measurement"},"Angaben zur Messung","Information on the measurement","Information on the measurement"]
[{"$f":"INDEX(B$11:J$227, ROW()-ROW(B$10), Start!$C$2)","v":"Goniospectrometric measurenent according to LM-79-08, EN 13032-4 and CIE S 025"},"Goniospektrometrische Messung entsprechend LM-79-08, EN 13032-4 und CIE S 025","Goniospectrometric measurenent according to LM-79-08, EN 13032-4 and CIE S 025","Goniospectrometric measurenent according to LM-79-08, EN 13032-4 and CIE S 025"]
[{"$f":"INDEX(B$11:J$227, ROW()-ROW(B$10), Start!$C$2)","v":"Measuring method"},"Messverfahren","Measuring method","Measuring method"]
[{"$f":"INDEX(B$11:J$227, ROW()-ROW(B$10), Start!$C$2)","v":"Wavelength range"},"Wellenlängenbereich","Wavelength range","Wavelength range"]
[{"$f":"INDEX(B$11:J$227, ROW()-ROW(B$10), Start!$C$2)","v":"Measuring results"},"Messergebnisse","Measuring results","Measuring results"]
[{"$f":"INDEX(B$11:J$227, ROW()-ROW(B$10), Start!$C$2)","v":"Color coordinates"},"Farbkoordinaten","Color coordinates","Color coordinates"]
[{"$f":"INDEX(B$11:J$227, ROW()-ROW(B$10), Start!$C$2)","v":"Color temperature [K]"},"Farbtemperatur [K]","Color temperature [K]","Color temperature [K]"]
[{"$f":"INDEX(B$11:J$227, ROW()-ROW(B$10), Start!$C$2)","v":"Dom. Wavelength [nm]"},"Dom. Wellenlänge [nm]","Dom. Wavelength [nm]","Dom. Wavelength [nm]"]
[{"$f":"INDEX(B$11:J$227, ROW()-ROW(B$10), Start!$C$2)","v":"Color saturation [%]"},"Farbsättigung [%]","Color saturation [%]","Color saturation [%]"]
[{"$f":"INDEX(B$11:J$227, ROW()-ROW(B$10), Start!$C$2)","v":"Max. delta u'v'"},"Max. delta u'v'","Max. delta u'v'","Max. delta u'v'"]
[{"$f":"INDEX(B$11:J$227, ROW()-ROW(B$10), Start!$C$2)","v":"Color Rendering Index (CRI)"},"Color Rendering Index (CRI)","Color Rendering Index (CRI)","Color Rendering Index (CRI)"]
[]
[{"$f":"INDEX(B$11:J$227, ROW()-ROW(B$10), Start!$C$2)","v":"Spectrum"},"Spektrum","Spectrum","Spectrum"]
[{"$f":"INDEX(B$11:J$227, ROW()-ROW(B$10), Start!$C$2)","v":"Color diagram (CIE 1931)"},"Farbdiagramm (CIE 1931)","Color diagram (CIE 1931)","Color diagram (CIE 1931)"]
[{"$f":"INDEX(B$11:J$227, ROW()-ROW(B$10), Start!$C$2)","v":"Wavelength [nm]"},"Wellenlänge [nm]","Wavelength [nm]","Wavelength [nm]"]